{"text_format":"3","workbook":"xlsx","n_sheets":29,"sheets":["PGC","Tiendas","Franquicias","Zonas","Días Semana","Familias","Cuentas","Pagos tienda","Tarjetas","VentasALMFranquiciasFirme","ConfigVentasALMFraqFirme","Asto.VentasALMFranquiciasFirme","VentasTPVFranquiciasEnFirme","ConfigVentasTPVFranqFirme","AstosVentasTPVFranquiciasFirme","ConfigVentasFranqDepósito","VentasTPVFranquiciasEnDepósito","AstosVentasTPVFranqDepósito","ConfigVentasTPVPropias","VentasTPVPropias","AstosVentasPropias","ConfigPagosTPV","PagosTPV","AstosPagosTPV","Nóminas","Sindicatos","ContabilizaciónNómina","ConfigNómina","AstosNómina"],"not_rendered":{"macros":1,"comments":1},"read":"whole","date_system":"1900"}

{"sheet":"PGC","index":0,"n_rows":2142,"n_cols":2,"rows_kept":2142}
["GRUPO 1","FINANCIACIÓN BÁSICA"]
["10.","CAPITAL"]
[1000000001,"CAPITAL SOCIAL"]
[101,"FONDO SOCIAL"]
[1020000001,"CAPITAL"]
[103,"SOCIOS POR DESEMBOLSOS NO EXIGIDOS"]
[1030,"SOCIOS POR DESEMBOLSOS NO EXIGIDOS, CAPITAL SOCIAL"]
[1034,"SOCIOS POR DESEMBOLSOS NO EXIGIDOS, CAPITAL PENDIENTE DE INSCRIPCIÓN"]
[104,"SOCIOS POR APORTACIONES NO DINERARIAS PENDIENTES"]
[1040,"SOCIOS POR APORTACIONES NO DINERARIAS PENDIENTES, CAPITAL SOCIAL"]
[1044,"SOCIOS POR APORTACIONES NO DINERARIAS PENDIENTES, CAPITAL PENDIENTE DE INSCRIPCIÓN"]
[108,"ACCIONES O PARTICIPACIONES PROPIAS EN SITUACIONES ESPECIALES"]
[109,"ACCIONES O PARTICIPACIONES PROPIAS PARA REDUCCIÓN DE CAPITAL"]
["11.","RESERVAS"]
[110,"PRIMA DE EMISIÓN O ASUNCIÓN"]
[1120000001,"RESERVA LEGAL"]
[1130000001,"RESERVAS VOLUNTARIAS"]
[114,"RESERVAS ESPECIALES"]
[1140,"RESERVAS PARA ACCIONES O PARTICIPACIONES DE LA SOCIEDAD DOMINANTE"]
[1141,"RESERVAS ESTATUTARIAS"]
[1142,"RESERVAS POR CAPITAL AMORTIZADO"]
[1144,"RESERVAS POR ACCIONES PROPIAS ACEPTADAS EN GARANTÍA"]
[118,"APORTACIONES DE SOCIOS O PROPIETARIOS"]
[119,"DIFERENCIAS POR AJUSTE DEL CAPITAL A EUROS"]
["12.","RESULTADOS PENDIENTES DE APLICACIÓN"]
[120,"REMANENTE"]
[121,"RESULTADOS NEGATIVOS DE EJERCICIOS ANTERIORES"]
[1210002012,"RESULTADOS NEGATIVOS DE EJERCICIOS ANTERIORES 2012"]
[1210002013,"RESULTADOS NEGATIVOS DE EJERCICIOS ANTERIORES 2013"]
[1210002014,"RESULTADOS NEGATIVOS DE EJERCICIOS ANTERIORES 2014"]
[1290000001,"RESULTADOS DEL EJERCICIO"]
["13.","SUBVENCIONES, DONACIONES, LEGADOS Y OTROS AJUSTES EN PATRIMONIO NETO"]
[1300000001,"SUBVENCIONES OFICIALES DE CAPITAL"]
[131,"DONACIONES Y LEGADOS DE CAPITAL"]
[1320000001,"OTRAS SUBVENCIONES, DONACIONES Y LEGADOS"]
[137,"INGRESOS FISCALES A DISTRIBUIR EN VARIOS EJERCICIOS"]
[1370000001,"INGRESOS FISCALES POR DIFERENCIAS PERMANENTES A DISTRIBUIR EN VARIOS EJERCICIOS"]
[1371000001,"INGRESOS FISCALES POR DEDUCCIONES Y BONIFICACIONES A DISTRIBUIR EN VARIOS EJERCICIOS"]
["14.","PROVISIONES"]
[141,"PROVISIÓN PARA IMPUESTOS"]
[142,"PROVISIÓN PARA OTRAS RESPONSABILIDADES"]
[143,"PROVISIÓN POR DESMANTELAMIENTO, RETIRO O REHABILITACIÓN DEL INMOVILIZADO"]
[1450000001,"PROVISIÓN PARA ACTUACIONES MEDIOAMBIENTALES"]
["15.","DEUDAS A LARGO PLAZO CON CARACTERÍSTICAS ESPECIALES"]
[150,"ACCIONES O PARTICIPACIONES A LARGO PLAZO CONSIDERADAS COMO PASIVOS FINANCIEROS"]
[153,"DESEMBOLSOS NO EXIGIDOS POR ACCIONES O PARTICIPACIONES CONSIDERADAS COMO PASIVOS FINANCIEROS"]
[1533,"DESEMBOLSOS NO EXIGIDOS, EMPRESAS DEL GRUPO"]
[1534,"DESEMBOLSOS NO EXIGIDOS, EMPRESAS ASOCIADAS"]
[1535,"DESEMBOLSOS NO EXIGIDOS, OTRAS PARTES VINCULADAS"]
[1536,"OTROS DESEMBOLSOS NO EXIGIDOS"]
[154,"APORTACIONES NO DINERARIAS PENDIENTES POR ACCIONES O PARTICIPACIONES CONSIDERADAS COMO PASIVOS FINANCIEROS"]
[1543,"APORTACIONES NO DINERARIAS PENDIENTES, EMPRESAS DEL GRUPO"]
[1544,"APORTACIONES NO DINERARIAS PENDIENTES, EMPRESAS ASOCIADAS"]
[1545,"APORTACIONES NO DINERARIAS PENDIENTES, OTRAS PARTES VINCULADAS"]
[1546,"OTRAS APORTACIONES NO DINERARIAS PENDIENTES"]
["16.","DEUDAS A LARGO PLAZO CON PARTES VINCULADAS"]
[160,"DEUDAS A LARGO PLAZO CON ENTIDADES DE CRÉDITO VINCULADAS"]
[1603,"DEUDAS A LARGO PLAZO CON ENTIDADES DE CRÉDITO, EMPRESAS DEL GRUPO"]
[1604,"DEUDAS A LARGO PLAZO CON ENTIDADES DE CRÉDITO, EMPRESAS ASOCIADAS"]
[1605,"DEUDAS A LARGO PLAZO CON OTRAS ENTIDADES DE CRÉDITO VINCULADAS"]
[161,"PROVEEDORES DE INMOVILIZADO A LARGO PLAZO, PARTES VINCULADAS"]
[1613,"PROVEEDORES DE INMOVILIZADO A LARGO PLAZO, EMPRESAS DEL GRUPO"]
[1614,"PROVEEDORES DE INMOVILIZADO A LARGO PLAZO, EMPRESAS ASOCIADAS"]
[1615,"PROVEEDORES DE INMOVILIZADO A LARGO PLAZO, OTRAS PARTES VINCULADAS"]
[162,"ACREEDORES POR ARRENDAMIENTO FINANCIERO A LARGO PLAZO, PARTES VINCULADAS"]
[1623,"ACREEDORES POR ARRENDAMIENTO FINANCIERO A LARGO PLAZO, EMPRESAS DE GRUPO"]
[1624,"ACREEDORES POR ARRENDAMIENTO FINANCIERO A LARGO PLAZO, EMPRESAS ASOCIADAS"]
[1625,"ACREEDORES POR ARRENDAMIENTO FINANCIERO A LARGO PLAZO, OTRAS PARTES VINCULADAS"]
[163,"OTRAS DEUDAS A LARGO PLAZO CON PARTES VINCULADAS"]
[1633,"OTRAS DEUDAS A LARGO PLAZO, EMPRESAS DEL GRUPO"]
[1634,"OTRAS DEUDAS A LARGO PLAZO, EMPRESAS ASOCIADAS"]
[1635,"OTRAS DEUDAS A LARGO PLAZO, CON OTRAS PARTES VINCULADAS"]
["17.","DEUDAS A LARGO PLAZO POR PRÉSTAMOS RECIBIDOS, EMPRÉSTITOS Y OTRO CONCEPTOS"]
[1700000001,"DEUDAS A LARGO PLAZO CON ENTIDADES DE CRÉDITO"]
[171,"DEUDAS A LARGO PLAZO"]
[172,"DEUDAS A LARGO PLAZO TRANSFORMABLES EN SUBVENCIONES, DONACIONES Y LEGADOS"]
[1730000001,"PROVEEDORES DE INMOVILIZADO A LARGO PLAZO"]
[174,"ACREEDORES POR ARRENDAMIENTO FINANCIERO A LARGO PLAZO"]
[175,"EFECTOS A PAGAR A LARGO PLAZO"]
[176,"PASIVOS POR DERIVADOS FINANCIEROS A LARGO PLAZO"]
[177,"OBLIGACIONES Y BONOS"]
[179,"DEUDAS REPRESENTADAS EN OTROS VALORES NEGOCIABLES"]
["18.","PASIVOS POR FIANZAS, GARANTÍAS Y OTROS CONCEPTOS A LARGO PLAZO"]
[180,"FIANZAS RECIBIDAS A LARGO PLAZO"]
[181,"ANTICIPOS RECIBIDOS POR VENTAS O PRESTACIONES"]
[185,"DEPÓSITOS RECIBIDOS A LARGO PLAZO"]
["19.","SITUACIONES TRANSITORIAS DE FINANCIACIÓN"]
[190,"ACCIONES O PARTICIPACIONES EMITIDAS"]
[192,"SUSCRIPTORES DE ACCIONES"]
[194,"CAPITAL EMITIDO PENDIENTE DE INSCRIPCIÓN"]
[195,"ACCIONES O PARTICIPACIONES EMITIDAS CONSIDERADAS COMO PASIVOS FINANCIEROS"]
[197,"SUSCRIPTORES DE ACCIONES CONSIDERADAS COMO PASIVOS FINANCIEROS"]
[199,"ACCIONES O PARTICIPACIONES EMITIDAS CONSIDERADAS COMO PASIVOS FINANCIEROS PENDIENTES DE INSCRIPCIÓN"]
["GRUPO 2","ACTIVO NO CORRIENTE"]
["20.","INMOVILIZACIONES INTANGIBLES"]
[200,"INVESTIGACIÓN"]
[201,"DESARROLLO"]
[202,"CONCESIONES ADMINISTRATIVAS"]
[203,"PROPIEDAD INDUSTRIAL"]
[205,"DERECHOS DE TRASPASO"]
[206,"APLICACIONES INFORMÁTICAS"]
[2060000001,"Programa de TPV"]
[209,"ANTICIPOS PARA INMOVILIZACIONES INTANGIBLES"]
["21.","INMOVILIZACIONES MATERIALES"]
[210,"TERRENOS Y BIENES NATURALES"]
[211,"CONSTRUCCIONES"]
[212,"INSTALACIONES TÉCNICAS"]
[213,"MAQUINARIA"]
[2130000001,"Carretillo elevador"]
[2130000002,"Plastificadora"]
[2130000003,"Etiquetadora"]
[2130000004,"Cinta transportadora"]
[2130000005,"Transpaletadora"]
[214,"UTILLAJE"]
[2140000001,"Utillaje tiendas"]
[2140000002,"Utillaje almacén"]
[215,"OTRAS INSTALACIONES"]
[216,"MOBILIARIO"]
[2160000001,"Mobiliario tiendas"]
[2160000002,"Mobiliario almacén"]
[217,"EQUIPOS PARA PROCESOS DE INFORMACIÓN"]
[2170000001,"Ordenadores "]
[{"$f":"\"2170000\"&Tiendas!A2&\"1\"","v":"2170000111"},{"$f":"\"Ordenadores Tienda\"&\" \"&Tiendas!B2","v":"Ordenadores Tienda A Coruña 1"}]
[{"$f":"\"2170000\"&Tiendas!A3&\"1\"","v":"2170000121"},{"$f":"\"Ordenadores Tienda\"&\" \"&Tiendas!B3","v":"Ordenadores Tienda A Coruña 2"}]
[{"$f":"\"2170000\"&Tiendas!A4&\"1\"","v":"2170000131"},{"$f":"\"Ordenadores Tienda\"&\" \"&Tiendas!B4","v":"Ordenadores Tienda A Coruña 3"}]
[{"$f":"\"2170000\"&Tiendas!A5&\"1\"","v":"2170000141"},{"$f":"\"Ordenadores Tienda\"&\" \"&Tiendas!B5","v":"Ordenadores Tienda A Coruña 4"}]
[{"$f":"\"2170000\"&Tiendas!A6&\"1\"","v":"2170000151"},{"$f":"\"Ordenadores Tienda\"&\" \"&Tiendas!B6","v":"Ordenadores Tienda A Coruña 5"}]
[{"$f":"\"2170000\"&Tiendas!A7&\"1\"","v":"2170000211"},{"$f":"\"Ordenadores Tienda\"&\" \"&Tiendas!B7","v":"Ordenadores Tienda Lugo 1"}]
[{"$f":"\"2170000\"&Tiendas!A8&\"1\"","v":"2170000221"},{"$f":"\"Ordenadores Tienda\"&\" \"&Tiendas!B8","v":"Ordenadores Tienda Lugo 2"}]
[{"$f":"\"2170000\"&Tiendas!A9&\"1\"","v":"2170000311"},{"$f":"\"Ordenadores Tienda\"&\" \"&Tiendas!B9","v":"Ordenadores Tienda Ourense 1"}]
[{"$f":"\"2170000\"&Tiendas!A10&\"1\"","v":"2170000321"},{"$f":"\"Ordenadores Tienda\"&\" \"&Tiendas!B10","v":"Ordenadores Tienda Ourense 2"}]
[{"$f":"\"2170000\"&Tiendas!A11&\"1\"","v":"2170000331"},{"$f":"\"Ordenadores Tienda\"&\" \"&Tiendas!B11","v":"Ordenadores Tienda Ourense 3"}]
[{"$f":"\"2170000\"&Tiendas!A12&\"1\"","v":"2170000411"},{"$f":"\"Ordenadores Tienda\"&\" \"&Tiendas!B12","v":"Ordenadores Tienda Pontevedra 1"}]
[{"$f":"\"2170000\"&Tiendas!A13&\"1\"","v":"2170000421"},{"$f":"\"Ordenadores Tienda\"&\" \"&Tiendas!B13","v":"Ordenadores Tienda Pontevedra 2"}]
[{"$f":"\"2170000\"&Tiendas!A14&\"1\"","v":"2170000431"},{"$f":"\"Ordenadores Tienda\"&\" \"&Tiendas!B14","v":"Ordenadores Tienda Pontevedra 3"}]
[{"$f":"\"2170000\"&Tiendas!A15&\"1\"","v":"2170000441"},{"$f":"\"Ordenadores Tienda\"&\" \"&Tiendas!B15","v":"Ordenadores Tienda Pontevedra 4"}]
[{"$f":"\"2170000\"&Tiendas!A16&\"1\"","v":"2170000511"},{"$f":"\"Ordenadores Tienda\"&\" \"&Tiendas!B16","v":"Ordenadores Tienda Madrid 1"}]
[{"$f":"\"2170000\"&Tiendas!A17&\"1\"","v":"2170000521"},{"$f":"\"Ordenadores Tienda\"&\" \"&Tiendas!B17","v":"Ordenadores Tienda Madrid 2"}]
[{"$f":"\"2170000\"&Tiendas!A18&\"1\"","v":"2170000531"},{"$f":"\"Ordenadores Tienda\"&\" \"&Tiendas!B18","v":"Ordenadores Tienda Madrid 3"}]
[{"$f":"\"2170000\"&Tiendas!A19&\"1\"","v":"2170000541"},{"$f":"\"Ordenadores Tienda\"&\" \"&Tiendas!B19","v":"Ordenadores Tienda Madrid 4"}]
[{"$f":"\"2170000\"&Tiendas!A20&\"1\"","v":"2170000551"},{"$f":"\"Ordenadores Tienda\"&\" \"&Tiendas!B20","v":"Ordenadores Tienda Madrid 5"}]
[{"$f":"\"2170000\"&Tiendas!A21&\"1\"","v":"2170000611"},{"$f":"\"Ordenadores Tienda\"&\" \"&Tiendas!B21","v":"Ordenadores Tienda Barcelona 1"}]
[{"$f":"\"2170000\"&Tiendas!A22&\"1\"","v":"2170000621"},{"$f":"\"Ordenadores Tienda\"&\" \"&Tiendas!B22","v":"Ordenadores Tienda Barcelona 2"}]
[{"$f":"\"2170000\"&Tiendas!A23&\"1\"","v":"2170000631"},{"$f":"\"Ordenadores Tienda\"&\" \"&Tiendas!B23","v":"Ordenadores Tienda Barcelona 3"}]
[{"$f":"\"2170000\"&Tiendas!A24&\"1\"","v":"2170000641"},{"$f":"\"Ordenadores Tienda\"&\" \"&Tiendas!B24","v":"Ordenadores Tienda Barcelona 4"}]
[{"$f":"\"2170000\"&Tiendas!A25&\"1\"","v":"2170000711"},{"$f":"\"Ordenadores Tienda\"&\" \"&Tiendas!B25","v":"Ordenadores Tienda Bilbao 1"}]
[{"$f":"\"2170000\"&Tiendas!A26&\"1\"","v":"2170000721"},{"$f":"\"Ordenadores Tienda\"&\" \"&Tiendas!B26","v":"Ordenadores Tienda Bilbao 2"}]
[2170000002,"TPV "]
[{"$f":"\"2170000\"&Tiendas!A2&2","v":"2170000112"},{"$f":"\"TPV\"&\" \"&Tiendas!B2","v":"TPV A Coruña 1"}]
[{"$f":"\"2170000\"&Tiendas!A3&2","v":"2170000122"},{"$f":"\"TPV\"&\" \"&Tiendas!B3","v":"TPV A Coruña 2"}]
[{"$f":"\"2170000\"&Tiendas!A4&2","v":"2170000132"},{"$f":"\"TPV\"&\" \"&Tiendas!B4","v":"TPV A Coruña 3"}]
[{"$f":"\"2170000\"&Tiendas!A5&2","v":"2170000142"},{"$f":"\"TPV\"&\" \"&Tiendas!B5","v":"TPV A Coruña 4"}]
[{"$f":"\"2170000\"&Tiendas!A6&2","v":"2170000152"},{"$f":"\"TPV\"&\" \"&Tiendas!B6","v":"TPV A Coruña 5"}]
[{"$f":"\"2170000\"&Tiendas!A7&2","v":"2170000212"},{"$f":"\"TPV\"&\" \"&Tiendas!B7","v":"TPV Lugo 1"}]
[{"$f":"\"2170000\"&Tiendas!A8&2","v":"2170000222"},{"$f":"\"TPV\"&\" \"&Tiendas!B8","v":"TPV Lugo 2"}]
[{"$f":"\"2170000\"&Tiendas!A9&2","v":"2170000312"},{"$f":"\"TPV\"&\" \"&Tiendas!B9","v":"TPV Ourense 1"}]
[{"$f":"\"2170000\"&Tiendas!A10&2","v":"2170000322"},{"$f":"\"TPV\"&\" \"&Tiendas!B10","v":"TPV Ourense 2"}]
[{"$f":"\"2170000\"&Tiendas!A11&2","v":"2170000332"},{"$f":"\"TPV\"&\" \"&Tiendas!B11","v":"TPV Ourense 3"}]
[{"$f":"\"2170000\"&Tiendas!A12&2","v":"2170000412"},{"$f":"\"TPV\"&\" \"&Tiendas!B12","v":"TPV Pontevedra 1"}]
[{"$f":"\"2170000\"&Tiendas!A13&2","v":"2170000422"},{"$f":"\"TPV\"&\" \"&Tiendas!B13","v":"TPV Pontevedra 2"}]
[{"$f":"\"2170000\"&Tiendas!A14&2","v":"2170000432"},{"$f":"\"TPV\"&\" \"&Tiendas!B14","v":"TPV Pontevedra 3"}]
[{"$f":"\"2170000\"&Tiendas!A15&2","v":"2170000442"},{"$f":"\"TPV\"&\" \"&Tiendas!B15","v":"TPV Pontevedra 4"}]
[{"$f":"\"2170000\"&Tiendas!A16&2","v":"2170000512"},{"$f":"\"TPV\"&\" \"&Tiendas!B16","v":"TPV Madrid 1"}]
[{"$f":"\"2170000\"&Tiendas!A17&2","v":"2170000522"},{"$f":"\"TPV\"&\" \"&Tiendas!B17","v":"TPV Madrid 2"}]
[{"$f":"\"2170000\"&Tiendas!A18&2","v":"2170000532"},{"$f":"\"TPV\"&\" \"&Tiendas!B18","v":"TPV Madrid 3"}]
[{"$f":"\"2170000\"&Tiendas!A19&2","v":"2170000542"},{"$f":"\"TPV\"&\" \"&Tiendas!B19","v":"TPV Madrid 4"}]
[{"$f":"\"2170000\"&Tiendas!A20&2","v":"2170000552"},{"$f":"\"TPV\"&\" \"&Tiendas!B20","v":"TPV Madrid 5"}]
[{"$f":"\"2170000\"&Tiendas!A21&2","v":"2170000612"},{"$f":"\"TPV\"&\" \"&Tiendas!B21","v":"TPV Barcelona 1"}]
[{"$f":"\"2170000\"&Tiendas!A22&2","v":"2170000622"},{"$f":"\"TPV\"&\" \"&Tiendas!B22","v":"TPV Barcelona 2"}]
[{"$f":"\"2170000\"&Tiendas!A23&2","v":"2170000632"},{"$f":"\"TPV\"&\" \"&Tiendas!B23","v":"TPV Barcelona 3"}]
[{"$f":"\"2170000\"&Tiendas!A24&2","v":"2170000642"},{"$f":"\"TPV\"&\" \"&Tiendas!B24","v":"TPV Barcelona 4"}]
[{"$f":"\"2170000\"&Tiendas!A25&2","v":"2170000712"},{"$f":"\"TPV\"&\" \"&Tiendas!B25","v":"TPV Bilbao 1"}]
[{"$f":"\"2170000\"&Tiendas!A26&2","v":"2170000722"},{"$f":"\"TPV\"&\" \"&Tiendas!B26","v":"TPV Bilbao 2"}]
[218,"ELEMENTOS DE TRANSPORTE"]
[2180000001,"Camiones"]
[{"$f":"\"21800000\"&Zonas!A4&\"1\"","v":"2180000011"},{"$f":"\"Camión\"&\" \"&Zonas!B4","v":"Camión Galicia"}]
[{"$f":"\"21800000\"&Zonas!A5&\"1\"","v":"2180000021"},{"$f":"\"Camión\"&\" \"&Zonas!B5","v":"Camión Madrid"}]
[{"$f":"\"21800000\"&Zonas!A6&\"1\"","v":"2180000031"},{"$f":"\"Camión\"&\" \"&Zonas!B6","v":"Camión Barcelona/Bilbao"}]
[219,"OTRO INMOVILIZADO MATERIAL"]
["22.","INVERSIONES INMOBILIARIAS"]
[220,"INVERSIONES EN TERRENOS Y BIENES NATURALES"]
[221,"INVERSIONES EN CONSTRUCCIONES"]
["23.","INMOVILIZACIONES MATERIALES EN CURSO"]
[230,"ADAPTACIÓN DE TERRENOS Y BIENES NATURALES"]
[231,"CONSTRUCCIONES EN CURSO"]
[232,"INSTALACIONES TÉCNICAS EN MONTAJE"]
[233,"MAQUINARIA EN MONTAJE"]
[237,"EQUIPOS PARA PROCESOS DE INFORMACIÓN EN MONTAJE"]
[239,"ANTICIPOS PARA INMOVILIZACIONES MATERIALES"]
["24.","INVERSIONES FINANCIERAS A LARGO PLAZO EN PARTES VINCULADAS"]
[240,"PARTICIPACIONES A LARGO PLAZO EN PARTES VINCULADAS"]
[2403,"PARTICIPACIONES A LARGO PLAZO EN EMPRESAS DEL GRUPO"]
[2404,"PARTICIPACIONES A LARGO PLAZO EN EMPRESAS ASOCIADAS"]
[2405,"PARTICIPACIONES A LARGO PLAZO EN OTRAS PARTES VINCULADAS"]
[241,"VALORES REPRESENTATIVOS DE DEUDA A LARGO PLAZO DE PARTES VINCULADAS"]
[2413,"VALORES REPRESENTATIVOS DE DEUDA A LARGO PLAZO DE EMPRESAS DEL GRUPO"]
[2414,"VALORES REPRESENTATIVOS DE DEUDA A LARGO PLAZO DE EMPRESAS ASOCIADAS"]
[2415,"VALORES REPRESENTATIVOS DE DEUDA A LARGO PLAZO DE OTRAS PARTES VINCULADAS"]
[242,"CRÉDITOS A LARGO PLAZO A PARTES VINCULADAS"]
[2423,"CRÉDITOS A LARGO PLAZO A EMPRESAS DEL GRUPO"]
[2424,"CRÉDITOS A LARGO PLAZO A EMPRESAS ASOCIADAS"]
[2425,"CRÉDITOS A LARGO PLAZO A OTRAS PARTES VINCULADAS"]
[249,"DESEMBOLSOS PENDIENTES SOBRE PARTICIPACIONES A LARGO PLAZO EN PARTES VINCULADAS"]
[2493,"DESEMBOLSOS PENDIENTES SOBRE PARTICIPACIONES A LARGO PLAZO EN EMPRESAS DEL GRUPO"]
[2494,"DESEMBOLSOS PENDIENTES SOBRE PARTICIPACIONES A LARGO PLAZO EN EMPRESAS ASOCIADAS"]
[2495,"DESEMBOLSOS PENDIENTES SOBRE PARTICIPACIONES A LARGO PLAZO EN OTRAS PARTES VINCULADAS"]
["25.","OTRAS INVERSIONES FINANCIERAS A LARGO PLAZO"]
[250,"INVERSIONES FINANCIERAS A LARGO PLAZO EN INSTRUMENTOS DE PATRIMONIO"]
[251,"VALORES REPRESENTATIVOS DE DEUDA A LARGO PLAZO"]
[252,"CRÉDITOS A LARGO PLAZO"]
[253,"CRÉDITOS A LARGO PLAZO POR ENAJENACIÓN DE INMOVILIZADO"]
[254,"CRÉDITOS A LARGO PLAZO AL PERSONAL"]
[255,"ACTIVOS POR DERIVADOS FINANCIEROS A LARGO PLAZO"]
[258,"IMPOSICIONES A LARGO PLAZO"]
[259,"DESEMBOLSOS PENDIENTES SOBRE PARTICIPACIONES EN EL PATRIMONIO NETO A LARGO PLAZO"]
["26.","FIANZAS Y DEPÓSITOS CONSTITUIDOS A LARGO PLAZO"]
[2600000001,"FIANZAS CONSTITUIDAS A LARGO PLAZO"]
[{"$f":"\"2600000\"&Tiendas!A2&\"1\"","v":"2600000111"},{"$f":"\"Fianza tienda\"&\" \"&Tiendas!B2","v":"Fianza tienda A Coruña 1"}]
[{"$f":"\"2600000\"&Tiendas!A6&\"1\"","v":"2600000151"},{"$f":"\"Fianza tienda\"&\" \"&Tiendas!B6","v":"Fianza tienda A Coruña 5"}]
[{"$f":"\"2600000\"&Tiendas!A10&\"1\"","v":"2600000321"},{"$f":"\"Fianza tienda\"&\" \"&Tiendas!B10","v":"Fianza tienda Ourense 2"}]
[{"$f":"\"2600000\"&Tiendas!A11&\"1\"","v":"2600000331"},{"$f":"\"Fianza tienda\"&\" \"&Tiendas!B11","v":"Fianza tienda Ourense 3"}]
[{"$f":"\"2600000\"&Tiendas!A13&\"1\"","v":"2600000421"},{"$f":"\"Fianza tienda\"&\" \"&Tiendas!B13","v":"Fianza tienda Pontevedra 2"}]
[{"$f":"\"2600000\"&Tiendas!A15&\"1\"","v":"2600000441"},{"$f":"\"Fianza tienda\"&\" \"&Tiendas!B15","v":"Fianza tienda Pontevedra 4"}]
[{"$f":"\"2600000\"&Tiendas!A18&\"1\"","v":"2600000531"},{"$f":"\"Fianza tienda\"&\" \"&Tiendas!B18","v":"Fianza tienda Madrid 3"}]
[{"$f":"\"2600000\"&Tiendas!A19&\"1\"","v":"2600000541"},{"$f":"\"Fianza tienda\"&\" \"&Tiendas!B19","v":"Fianza tienda Madrid 4"}]
[{"$f":"\"2600000\"&Tiendas!A21&\"1\"","v":"2600000611"},{"$f":"\"Fianza tienda\"&\" \"&Tiendas!B21","v":"Fianza tienda Barcelona 1"}]
[{"$f":"\"2600000\"&Tiendas!A22&\"1\"","v":"2600000621"},{"$f":"\"Fianza tienda\"&\" \"&Tiendas!B22","v":"Fianza tienda Barcelona 2"}]
[{"$f":"\"2600000\"&Tiendas!A23&\"1\"","v":"2600000631"},{"$f":"\"Fianza tienda\"&\" \"&Tiendas!B23","v":"Fianza tienda Barcelona 3"}]
[{"$f":"\"2600000\"&Tiendas!A25&\"1\"","v":"2600000711"},{"$f":"\"Fianza tienda\"&\" \"&Tiendas!B25","v":"Fianza tienda Bilbao 1"}]
[{"$f":"\"2600000\"&Tiendas!A26&\"1\"","v":"2600000721"},{"$f":"\"Fianza tienda\"&\" \"&Tiendas!B26","v":"Fianza tienda Bilbao 2"}]
[{"$f":"\"2600000\"&Tiendas!A27&\"1\"","v":"2600000801"},{"$f":"\"Fianza tienda\"&\" \"&Tiendas!B27","v":"Fianza tienda Almacén"}]
[265,"DEPÓSITOS CONSTITUIDOS A LARGO PLAZO"]
["28.","AMORTIZACIÓN ACUMULADA DEL INMOVILIZADO"]
[280,"AMORTIZACIÓN ACUMULADA DEL INMOVILIZADO INTANGIBLE"]
[2800,"AMORTIZACIÓN ACUMULADA  DE INVESTIGACIÓN"]
[2801,"AMORTIZACIÓN ACUMULADA DE DESARROLLO"]
[2802,"AMORTIZACIÓN ACUMULADA DE CONCESIONES ADMINISTRATIVAS"]
[2803,"AMORTIZACIÓN ACUMULADA DE PROPIEDAD INDUSTRIAL"]
[2805,"AMORTIZACIÓN ACUMULADA DE DERECHOS DE TRASPASO"]
[2806,"AMORTIZACIÓN ACUMULADA DE APLICACIONES INFORMÁTICAS"]
[2806000001,"Amortización acumulada programa de TPV"]
[281,"AMORTIZACIÓN ACUMULADA DEL INMOVILIZADO MATERIAL"]
[2811,"AMORTIZACIÓN ACUMULADA DE CONSTRUCCIONES"]
[2812,"AMORTIZACIÓN ACUMULADA DE INSTALACIONES TÉCNICAS"]
[2813,"AMORTIZACIÓN ACUMULADA DE MAQUINARIA"]
[2813000001,"Amortización acumulada carretillo elevador"]
[2813000002,"Amortización acumulada plastificadora"]
[2813000003,"Amortización acumulada etiquetadora"]
[2813000004,"Amortización acumulada cinta transportadora"]
[2813000005,"Amortización acumulada transpaletadora"]
[2814,"AMORTIZACIÓN ACUMULADA DE UTILLAJE"]
[2814000001,"Amortización acumulada utillaje tiendas"]
[2814000002,"Amortización acumulada utillaje almacén"]
[2815,"AMORTIZACIÓN ACUMULADA DE OTRAS INSTALACIONES"]
[2816,"AMORTIZACIÓN ACUMULADA DE MOBILIARIO"]
[2816000001,"Amortización acumulada mobiliario tiendas"]
[2816000002,"Amortización acumulada mobiliario almacén"]
[2817,"AMORTIZACIÓN ACUMULADA DE EQUIPOS PARA PROCESOS DE INFORMACIÓN"]
[28170001,"Amortización acumulada Ordenadores"]
[{"$f":"\"2817000\"&Tiendas!A2&\"1\"","v":"2817000111"},{"$f":"\"Amortización acumulada\"&\" \"&\"Ordenadores Tienda\"&\" \"&Tiendas!B2","v":"Amortización acumulada Ordenadores Tienda A Coruña 1"}]
[{"$f":"\"2817000\"&Tiendas!A3&\"1\"","v":"2817000121"},{"$f":"\"Amortización acumulada\"&\" \"&\"Ordenadores Tienda\"&\" \"&Tiendas!B3","v":"Amortización acumulada Ordenadores Tienda A Coruña 2"}]
[{"$f":"\"2817000\"&Tiendas!A4&\"1\"","v":"2817000131"},{"$f":"\"Amortización acumulada\"&\" \"&\"Ordenadores Tienda\"&\" \"&Tiendas!B4","v":"Amortización acumulada Ordenadores Tienda A Coruña 3"}]
[{"$f":"\"2817000\"&Tiendas!A5&\"1\"","v":"2817000141"},{"$f":"\"Amortización acumulada\"&\" \"&\"Ordenadores Tienda\"&\" \"&Tiendas!B5","v":"Amortización acumulada Ordenadores Tienda A Coruña 4"}]
[{"$f":"\"2817000\"&Tiendas!A6&\"1\"","v":"2817000151"},{"$f":"\"Amortización acumulada\"&\" \"&\"Ordenadores Tienda\"&\" \"&Tiendas!B6","v":"Amortización acumulada Ordenadores Tienda A Coruña 5"}]
[{"$f":"\"2817000\"&Tiendas!A7&\"1\"","v":"2817000211"},{"$f":"\"Amortización acumulada\"&\" \"&\"Ordenadores Tienda\"&\" \"&Tiendas!B7","v":"Amortización acumulada Ordenadores Tienda Lugo 1"}]
[{"$f":"\"2817000\"&Tiendas!A8&\"1\"","v":"2817000221"},{"$f":"\"Amortización acumulada\"&\" \"&\"Ordenadores Tienda\"&\" \"&Tiendas!B8","v":"Amortización acumulada Ordenadores Tienda Lugo 2"}]
[{"$f":"\"2817000\"&Tiendas!A9&\"1\"","v":"2817000311"},{"$f":"\"Amortización acumulada\"&\" \"&\"Ordenadores Tienda\"&\" \"&Tiendas!B9","v":"Amortización acumulada Ordenadores Tienda Ourense 1"}]
[{"$f":"\"2817000\"&Tiendas!A10&\"1\"","v":"2817000321"},{"$f":"\"Amortización acumulada\"&\" \"&\"Ordenadores Tienda\"&\" \"&Tiendas!B10","v":"Amortización acumulada Ordenadores Tienda Ourense 2"}]
[{"$f":"\"2817000\"&Tiendas!A11&\"1\"","v":"2817000331"},{"$f":"\"Amortización acumulada\"&\" \"&\"Ordenadores Tienda\"&\" \"&Tiendas!B11","v":"Amortización acumulada Ordenadores Tienda Ourense 3"}]
[{"$f":"\"2817000\"&Tiendas!A12&\"1\"","v":"2817000411"},{"$f":"\"Amortización acumulada\"&\" \"&\"Ordenadores Tienda\"&\" \"&Tiendas!B12","v":"Amortización acumulada Ordenadores Tienda Pontevedra 1"}]
[{"$f":"\"2817000\"&Tiendas!A13&\"1\"","v":"2817000421"},{"$f":"\"Amortización acumulada\"&\" \"&\"Ordenadores Tienda\"&\" \"&Tiendas!B13","v":"Amortización acumulada Ordenadores Tienda Pontevedra 2"}]
[{"$f":"\"2817000\"&Tiendas!A14&\"1\"","v":"2817000431"},{"$f":"\"Amortización acumulada\"&\" \"&\"Ordenadores Tienda\"&\" \"&Tiendas!B14","v":"Amortización acumulada Ordenadores Tienda Pontevedra 3"}]
[{"$f":"\"2817000\"&Tiendas!A15&\"1\"","v":"2817000441"},{"$f":"\"Amortización acumulada\"&\" \"&\"Ordenadores Tienda\"&\" \"&Tiendas!B15","v":"Amortización acumulada Ordenadores Tienda Pontevedra 4"}]
[{"$f":"\"2817000\"&Tiendas!A16&\"1\"","v":"2817000511"},{"$f":"\"Amortización acumulada\"&\" \"&\"Ordenadores Tienda\"&\" \"&Tiendas!B16","v":"Amortización acumulada Ordenadores Tienda Madrid 1"}]
[{"$f":"\"2817000\"&Tiendas!A17&\"1\"","v":"2817000521"},{"$f":"\"Amortización acumulada\"&\" \"&\"Ordenadores Tienda\"&\" \"&Tiendas!B17","v":"Amortización acumulada Ordenadores Tienda Madrid 2"}]
[{"$f":"\"2817000\"&Tiendas!A18&\"1\"","v":"2817000531"},{"$f":"\"Amortización acumulada\"&\" \"&\"Ordenadores Tienda\"&\" \"&Tiendas!B18","v":"Amortización acumulada Ordenadores Tienda Madrid 3"}]
[{"$f":"\"2817000\"&Tiendas!A19&\"1\"","v":"2817000541"},{"$f":"\"Amortización acumulada\"&\" \"&\"Ordenadores Tienda\"&\" \"&Tiendas!B19","v":"Amortización acumulada Ordenadores Tienda Madrid 4"}]
[{"$f":"\"2817000\"&Tiendas!A20&\"1\"","v":"2817000551"},{"$f":"\"Amortización acumulada\"&\" \"&\"Ordenadores Tienda\"&\" \"&Tiendas!B20","v":"Amortización acumulada Ordenadores Tienda Madrid 5"}]
[{"$f":"\"2817000\"&Tiendas!A21&\"1\"","v":"2817000611"},{"$f":"\"Amortización acumulada\"&\" \"&\"Ordenadores Tienda\"&\" \"&Tiendas!B21","v":"Amortización acumulada Ordenadores Tienda Barcelona 1"}]
[{"$f":"\"2817000\"&Tiendas!A22&\"1\"","v":"2817000621"},{"$f":"\"Amortización acumulada\"&\" \"&\"Ordenadores Tienda\"&\" \"&Tiendas!B22","v":"Amortización acumulada Ordenadores Tienda Barcelona 2"}]
[{"$f":"\"2817000\"&Tiendas!A23&\"1\"","v":"2817000631"},{"$f":"\"Amortización acumulada\"&\" \"&\"Ordenadores Tienda\"&\" \"&Tiendas!B23","v":"Amortización acumulada Ordenadores Tienda Barcelona 3"}]
[{"$f":"\"2817000\"&Tiendas!A24&\"1\"","v":"2817000641"},{"$f":"\"Amortización acumulada\"&\" \"&\"Ordenadores Tienda\"&\" \"&Tiendas!B24","v":"Amortización acumulada Ordenadores Tienda Barcelona 4"}]
[{"$f":"\"2817000\"&Tiendas!A25&\"1\"","v":"2817000711"},{"$f":"\"Amortización acumulada\"&\" \"&\"Ordenadores Tienda\"&\" \"&Tiendas!B25","v":"Amortización acumulada Ordenadores Tienda Bilbao 1"}]
[{"$f":"\"2817000\"&Tiendas!A26&\"1\"","v":"2817000721"},{"$f":"\"Amortización acumulada\"&\" \"&\"Ordenadores Tienda\"&\" \"&Tiendas!B26","v":"Amortización acumulada Ordenadores Tienda Bilbao 2"}]
[28170001,"Amortización acumulada TPV"]
[{"$f":"\"2817000\"&Tiendas!A2&2","v":"2817000112"},{"$f":"\"Amortización acumulada\"&\" \"&\"TPV\"&\" \"&Tiendas!B2","v":"Amortización acumulada TPV A Coruña 1"}]
[{"$f":"\"2817000\"&Tiendas!A3&2","v":"2817000122"},{"$f":"\"Amortización acumulada\"&\" \"&\"TPV\"&\" \"&Tiendas!B3","v":"Amortización acumulada TPV A Coruña 2"}]
[{"$f":"\"2817000\"&Tiendas!A4&2","v":"2817000132"},{"$f":"\"Amortización acumulada\"&\" \"&\"TPV\"&\" \"&Tiendas!B4","v":"Amortización acumulada TPV A Coruña 3"}]
[{"$f":"\"2817000\"&Tiendas!A5&2","v":"2817000142"},{"$f":"\"Amortización acumulada\"&\" \"&\"TPV\"&\" \"&Tiendas!B5","v":"Amortización acumulada TPV A Coruña 4"}]
[{"$f":"\"2817000\"&Tiendas!A6&2","v":"2817000152"},{"$f":"\"Amortización acumulada\"&\" \"&\"TPV\"&\" \"&Tiendas!B6","v":"Amortización acumulada TPV A Coruña 5"}]
[{"$f":"\"2817000\"&Tiendas!A7&2","v":"2817000212"},{"$f":"\"Amortización acumulada\"&\" \"&\"TPV\"&\" \"&Tiendas!B7","v":"Amortización acumulada TPV Lugo 1"}]
[{"$f":"\"2817000\"&Tiendas!A8&2","v":"2817000222"},{"$f":"\"Amortización acumulada\"&\" \"&\"TPV\"&\" \"&Tiendas!B8","v":"Amortización acumulada TPV Lugo 2"}]
[{"$f":"\"2817000\"&Tiendas!A9&2","v":"2817000312"},{"$f":"\"Amortización acumulada\"&\" \"&\"TPV\"&\" \"&Tiendas!B9","v":"Amortización acumulada TPV Ourense 1"}]
[{"$f":"\"2817000\"&Tiendas!A10&2","v":"2817000322"},{"$f":"\"Amortización acumulada\"&\" \"&\"TPV\"&\" \"&Tiendas!B10","v":"Amortización acumulada TPV Ourense 2"}]
[{"$f":"\"2817000\"&Tiendas!A11&2","v":"2817000332"},{"$f":"\"Amortización acumulada\"&\" \"&\"TPV\"&\" \"&Tiendas!B11","v":"Amortización acumulada TPV Ourense 3"}]
[{"$f":"\"2817000\"&Tiendas!A12&2","v":"2817000412"},{"$f":"\"Amortización acumulada\"&\" \"&\"TPV\"&\" \"&Tiendas!B12","v":"Amortización acumulada TPV Pontevedra 1"}]
[{"$f":"\"2817000\"&Tiendas!A13&2","v":"2817000422"},{"$f":"\"Amortización acumulada\"&\" \"&\"TPV\"&\" \"&Tiendas!B13","v":"Amortización acumulada TPV Pontevedra 2"}]
[{"$f":"\"2817000\"&Tiendas!A14&2","v":"2817000432"},{"$f":"\"Amortización acumulada\"&\" \"&\"TPV\"&\" \"&Tiendas!B14","v":"Amortización acumulada TPV Pontevedra 3"}]
[{"$f":"\"2817000\"&Tiendas!A15&2","v":"2817000442"},{"$f":"\"Amortización acumulada\"&\" \"&\"TPV\"&\" \"&Tiendas!B15","v":"Amortización acumulada TPV Pontevedra 4"}]
[{"$f":"\"2817000\"&Tiendas!A16&2","v":"2817000512"},{"$f":"\"Amortización acumulada\"&\" \"&\"TPV\"&\" \"&Tiendas!B16","v":"Amortización acumulada TPV Madrid 1"}]
[{"$f":"\"2817000\"&Tiendas!A17&2","v":"2817000522"},{"$f":"\"Amortización acumulada\"&\" \"&\"TPV\"&\" \"&Tiendas!B17","v":"Amortización acumulada TPV Madrid 2"}]
[{"$f":"\"2817000\"&Tiendas!A18&2","v":"2817000532"},{"$f":"\"Amortización acumulada\"&\" \"&\"TPV\"&\" \"&Tiendas!B18","v":"Amortización acumulada TPV Madrid 3"}]
[{"$f":"\"2817000\"&Tiendas!A19&2","v":"2817000542"},{"$f":"\"Amortización acumulada\"&\" \"&\"TPV\"&\" \"&Tiendas!B19","v":"Amortización acumulada TPV Madrid 4"}]
[{"$f":"\"2817000\"&Tiendas!A20&2","v":"2817000552"},{"$f":"\"Amortización acumulada\"&\" \"&\"TPV\"&\" \"&Tiendas!B20","v":"Amortización acumulada TPV Madrid 5"}]
[{"$f":"\"2817000\"&Tiendas!A21&2","v":"2817000612"},{"$f":"\"Amortización acumulada\"&\" \"&\"TPV\"&\" \"&Tiendas!B21","v":"Amortización acumulada TPV Barcelona 1"}]
[{"$f":"\"2817000\"&Tiendas!A22&2","v":"2817000622"},{"$f":"\"Amortización acumulada\"&\" \"&\"TPV\"&\" \"&Tiendas!B22","v":"Amortización acumulada TPV Barcelona 2"}]
[{"$f":"\"2817000\"&Tiendas!A23&2","v":"2817000632"},{"$f":"\"Amortización acumulada\"&\" \"&\"TPV\"&\" \"&Tiendas!B23","v":"Amortización acumulada TPV Barcelona 3"}]
[{"$f":"\"2817000\"&Tiendas!A24&2","v":"2817000642"},{"$f":"\"Amortización acumulada\"&\" \"&\"TPV\"&\" \"&Tiendas!B24","v":"Amortización acumulada TPV Barcelona 4"}]
[{"$f":"\"2817000\"&Tiendas!A25&2","v":"2817000712"},{"$f":"\"Amortización acumulada\"&\" \"&\"TPV\"&\" \"&Tiendas!B25","v":"Amortización acumulada TPV Bilbao 1"}]
[{"$f":"\"2817000\"&Tiendas!A26&2","v":"2817000722"},{"$f":"\"Amortización acumulada\"&\" \"&\"TPV\"&\" \"&Tiendas!B26","v":"Amortización acumulada TPV Bilbao 2"}]
[2818,"AMORTIZACIÓN ACUMULADA DE ELEMENTOS DE TRANSPORTE"]
[{"$f":"\"28180000\"&Zonas!A4&\"1\"","v":"2818000011"},{"$f":"\"Amortización acumulada\"&\" \"&\"camión\"&\" \"&Zonas!B4","v":"Amortización acumulada camión Galicia"}]
[{"$f":"\"28180000\"&Zonas!A5&\"1\"","v":"2818000021"},{"$f":"\"Amortización acumulada\"&\" \"&\"camión\"&\" \"&Zonas!B5","v":"Amortización acumulada camión Madrid"}]
[{"$f":"\"28180000\"&Zonas!A6&\"1\"","v":"2818000031"},{"$f":"\"Amortización acumulada\"&\" \"&\"camión\"&\" \"&Zonas!B6","v":"Amortización acumulada camión Barcelona/Bilbao"}]
[2819,"AMORTIZACIÓN ACUMULADA DE OTRO INMOVILIZADO MATERIAL"]
[282,"AMORTIZACIÓN ACUMULADA DE LAS INVERSIONES INMOBILIARIAS"]
["29.","DETERIORO DE VALOR DE ACTIVOS NO CORRIENTES"]
[290,"DETERIORO DE VALOR DEL INMOVILIZADO INTANGIBLE"]
[2900,"DETERIORO DE VALOR DE GASTOS DE INVESTIGACIÓN"]
[2901,"DETERIORO DE VALOR DE DESARROLLO"]
[2902,"DETERIORO DE VALOR DE CONCESIONES ADMINISTRATIVAS"]
[2903,"DETERIORO DE VALOR DE PROPIEDAD INDUSTRIAL"]
[2905,"DETERIORO DE VALOR DE DERECHOS DE TRASPASO"]
[2906,"DETERIORO DE VALOR DE APLICACIONES INFORMÁTICAS"]
[291,"DETERIORO DE VALOR DEL INMOVILIZADO MATERIAL"]
[2910,"DETERIORO DE VALOR DE TERRENOS Y BIENES NATURALES"]
[2911,"DETERIORO DE VALOR DE CONSTRUCCIONES"]
[2912,"DETERIORO DE VALOR DE INSTALACIONES TÉCNICAS"]
[2913,"DETERIORO DE VALOR DE MAQUINARIA"]
[2914,"DETERIORO DE VALOR DE UTILLAJE"]
[2915,"DETERIORO DE VALOR DE OTRAS INSTALACIONES"]
[2916,"DETERIORO DE VALOR DE MOBILIARIO"]
[2917,"DETERIORO DE VALOR DE EQUIPOS PARA PROCESOS DE INFORMACIÓN"]
[2918,"DETERIORO DE VALOR DE ELEMENTOS DE TRANSPORTE"]
[2919,"DETERIORO DE VALOR DE OTRO INMOVILIZADO MATERIAL"]
[292,"DETERIORO DE VALOR DE LAS INVERSIONES INMOBILIARIAS"]
[2920,"DETERIORO DE VALOR DE LOS TERRENOS Y BIENES NATURALES"]
[2921,"DETERIORO DE VALOR DE CONSTRUCCIONES"]
[293,"DETERIORO DE VALOR DE PARTICIPACIONES A LARGO PLAZO EN PARTES VINCULADAS"]
[2933,"DETERIORO DE VALOR DE PARTICIPACIONES A LARGO PLAZO EN EMPRESAS DEL GRUPO"]
[2934,"DETERIORO DE VALOR DE PARTICIPACIONES A LARGO PLAZO EN EMPRESAS ASOCIADAS"]
[2935,"DETERIORO DE VALOR DE PARTICIPACIONES A LARGO PLAZO EN OTRAS PARTES VINCULADAS"]
[294,"DETERIORO DE VALOR DE VALORES REPRESENTATIVOS DE DEUDA A LARGO PLAZO DE PARTES VINCULADAS"]
[2943,"DETERIORO DE VALOR DE VALORES REPRESENTATIVOS DE DEUDA A LARGO PLAZO DE EMPRESAS DEL GRUPO"]
[2944,"DETERIORO DE VALOR DE VALORES REPRESENTATIVOS DE DEUDA A LARGO PLAZO DE EMPRESAS ASOCIADAS"]
[2945,"DETERIORO DE VALOR DE VALORES REPRESENTATIVOS DE DEUDA A LARGO PLAZO DE OTRAS PARTES VINCULADAS"]
[295,"DETERIORO DE VALOR DE CRÉDITOS A LARGO PLAZO A PARTES VINCULADAS"]
[2953,"DETERIORO DE VALOR DE CRÉDITOS A LARGO PLAZO A EMPRESAS DEL GRUPO"]
[2954,"DETERIORO DE VALOR DE CRÉDITOS A LARGO PLAZO A EMPRESAS ASOCIADAS"]
[2955,"DETERIORO DE VALOR DE CRÉDITOS A LARGO PLAZO A OTRAS PARTES VINCULADAS"]
[296,"DETERIORO DE VALOR DE PARTICIPACIONES EN EL PATRIMONIO NETO A LARGO PLAZO"]
[297,"DETERIORO DE VALOR DE VALORES REPRESENTATIVOS DE DEUDA A LARGO PLAZO"]
[298,"DETERIORO DE VALOR DE CRÉDITOS A LARGO PLAZO"]
["GRUPO 3","EXISTENCIAS"]
["30.","COMERCIALES"]
[{"$f":"\"3000000\"&Familias!A3","v":"3000000111"},{"$f":"\"Producto\"&\" \"&Familias!B3","v":"Producto Mar"}]
[{"$f":"\"3000000\"&Familias!A4","v":"3000000112"},{"$f":"\"Producto\"&\" \"&Familias!B4","v":"Producto Campo"}]
[{"$f":"\"3000000\"&Familias!A5","v":"3000000113"},{"$f":"\"Producto\"&\" \"&Familias!B5","v":"Producto Bebidas"}]
[{"$f":"\"3000000\"&Familias!A6","v":"3000000121"},{"$f":"\"Producto\"&\" \"&Familias!B6","v":"Producto Cerámicas"}]
[{"$f":"\"3000000\"&Familias!A7","v":"3000000122"},{"$f":"\"Producto\"&\" \"&Familias!B7","v":"Producto Encaje"}]
[{"$f":"\"3000000\"&Familias!A8","v":"3000000123"},{"$f":"\"Producto\"&\" \"&Familias!B8","v":"Producto Cuero"}]
["31.","MATERIAS PRIMAS"]
[310,"MATERIAS PRIMAS A"]
[311,"MATERIAS PRIMAS B"]
["32.","OTROS APROVISIONAMIENTOS"]
[320,"ELEMENTOS Y CONJUNTOS INCORPORABLES"]
[321,"COMBUSTIBLES"]
[322,"REPUESTOS"]
[325,"MATERIALES DIVERSOS"]
[326,"EMBALAJES"]
[{"$f":"\"3260000\"&Familias!A3","v":"3260000111"},{"$f":"\"Embalaje\"&\" \"&Familias!B3","v":"Embalaje Mar"}]
[{"$f":"\"3260000\"&Familias!A4","v":"3260000112"},{"$f":"\"Embalaje\"&\" \"&Familias!B4","v":"Embalaje Campo"}]
[{"$f":"\"3260000\"&Familias!A5","v":"3260000113"},{"$f":"\"Embalaje\"&\" \"&Familias!B5","v":"Embalaje Bebidas"}]
[{"$f":"\"3260000\"&Familias!A6","v":"3260000121"},{"$f":"\"Embalaje\"&\" \"&Familias!B6","v":"Embalaje Cerámicas"}]
[{"$f":"\"3260000\"&Familias!A7","v":"3260000122"},{"$f":"\"Embalaje\"&\" \"&Familias!B7","v":"Embalaje Encaje"}]
[{"$f":"\"3260000\"&Familias!A8","v":"3260000123"},{"$f":"\"Embalaje\"&\" \"&Familias!B8","v":"Embalaje Cuero"}]
[327,"ENVASES"]
[328,"MATERIAL DE OFICINA"]
["33.","PRODUCTOS EN CURSO"]
[330,"PRODUCTOS EN CURSO A"]
[331,"PRODUCTOS EN CURSO B"]
["34.","PRODUCTOS SEMITERMINADOS"]
[340,"PRODUCTOS SEMITERMINADOS A"]
[341,"PRODUCTOS SEMITERMINADOS B"]
["35.","PRODUCTOS TERMINADOS"]
[350,"PRODUCTOS TERMINADOS A"]
[351,"PRODUCTOS TERMINADOS B"]
["36.","SUBPRODUCTOS, RESIDUOS Y MATERIALES RECUPERADOS"]
[360,"SUBPRODUCTOS A"]
[361,"SUBPRODUCTOS B"]
[365,"RESIDUOS A"]
[366,"RESIDUOS B"]
[368,"MATERIALES RECUPERADOS A"]
[369,"MATERIALES RECUPERADOS B"]
["39.","DETERIORO DE VALOR DE LAS EXISTENCIAS"]
[390,"DETERIORO DE VALOR DE LAS MERCADERÍAS"]
[{"$f":"\"3000000\"&Familias!A3","v":"3000000111"},{"$f":"\"Deterioro valor producto\"&\" \"&Familias!B3","v":"Deterioro valor producto Mar"}]
[{"$f":"\"3000000\"&Familias!A4","v":"3000000112"},{"$f":"\"Deterioro valor producto\"&\" \"&Familias!B4","v":"Deterioro valor producto Campo"}]
[{"$f":"\"3000000\"&Familias!A5","v":"3000000113"},{"$f":"\"Deterioro valor producto\"&\" \"&Familias!B5","v":"Deterioro valor producto Bebidas"}]
[{"$f":"\"3000000\"&Familias!A6","v":"3000000121"},{"$f":"\"Deterioro valor producto\"&\" \"&Familias!B6","v":"Deterioro valor producto Cerámicas"}]
[{"$f":"\"3000000\"&Familias!A7","v":"3000000122"},{"$f":"\"Deterioro valor producto\"&\" \"&Familias!B7","v":"Deterioro valor producto Encaje"}]
[{"$f":"\"3000000\"&Familias!A8","v":"3000000123"},{"$f":"\"Deterioro valor producto\"&\" \"&Familias!B8","v":"Deterioro valor producto Cuero"}]
[391,"DETERIORO DE VALOR DE LAS MATERIAS PRIMAS"]
[392,"DETERIORO DE VALOR DE OTROS APROVISIONAMIENTOS"]
[393,"DETERIORO DE VALOR DE LOS PRODUCTOS EN CURSO"]
[394,"DETERIORO DE VALOR DE LOS PRODUCTOS SEMITERMINADOS"]
[395,"DETERIORO DE VALOR DE LOS PRODUCTOS TERMINADOS"]
[396,"DETERIORO DE VALOR DE LOS SUBPRODUCTOS, RESIDUOS Y MATERIALES RECUPERADOS"]
["GRUPO 4","ACREEDORES Y DEUDORES POR OPERACIONES COMERCIALES"]
["40.","PROVEEDORES"]
[400,"PROVEEDORES"]
[4000,"PROVEEDORES (EUROS)"]
[{"$f":"\"4000000\"&Familias!A3","v":"4000000111"},{"$f":"\"Proveedores producto\"&\" \"&Familias!B3","v":"Proveedores producto Mar"}]
[{"$f":"\"4000000\"&Familias!A4","v":"4000000112"},{"$f":"\"Proveedores producto\"&\" \"&Familias!B4","v":"Proveedores producto Campo"}]
[{"$f":"\"4000000\"&Familias!A5","v":"4000000113"},{"$f":"\"Proveedores producto\"&\" \"&Familias!B5","v":"Proveedores producto Bebidas"}]
[{"$f":"\"4000000\"&Familias!A6","v":"4000000121"},{"$f":"\"Proveedores producto\"&\" \"&Familias!B6","v":"Proveedores producto Cerámicas"}]
[{"$f":"\"4000000\"&Familias!A7","v":"4000000122"},{"$f":"\"Proveedores producto\"&\" \"&Familias!B7","v":"Proveedores producto Encaje"}]
[{"$f":"\"4000000\"&Familias!A8","v":"4000000123"},{"$f":"\"Proveedores producto\"&\" \"&Familias!B8","v":"Proveedores producto Cuero"}]
[4004,"PROVEEDORES (MONEDA EXTRANJERA)"]
[4009,"PROVEEDORES, FACTURAS PENDIENTES DE RECIBIR O DE FORMALIZAR"]
[401,"PROVEEDORES, EFECTOS COMERCIALES A PAGAR"]
[403,"PROVEEDORES, EMPRESAS DEL GRUPO"]
[4030,"PROVEEDORES, EMPRESAS DEL GRUPO (EUROS)"]
[4031,"EFECTOS COMERCIALES A PAGAR, EMPRESAS DEL GRUPO"]
[4034,"PROVEEDORES, EMPRESAS DEL GRUPO (MONEDA EXTRANJERA)"]
[4036,"ENVASES Y EMBALAJES A DEVOLVER A PROVEEDORES, EMPRESAS DEL GRUPO"]
[4039,"PROVEEDORES, EMPRESAS DEL GRUPO, FACTURAS PENDIENTES DE RECIBIR O DE FORMALIZAR"]
[404,"PROVEEDORES, EMPRESAS ASOCIADAS"]
[405,"PROVEEDORES, OTRAS PARTES VINCULADAS"]
[406,"ENVASES Y EMBALAJES A DEVOLVER A PROVEEDORES"]
[407,"ANTICIPOS A PROVEEDORES"]
["41.","ACREEDORES VARIOS"]
[410,"ACREEDORES POR PRESTACIONES DE SERVICIOS"]
[4100,"ACREEDORES POR PRESTACIONES DE SERVICIOS (EUROS)"]
[4100000001,"Acreedor empresa de transporte"]
[4100000002,"Acreedor suministros"]
[4100000003,"Acreedor empresa aseguradora"]
[4104,"ACREEDORES POR PRESTACIONES DE SERVICIOS, (MONEDA EXTRANJERA)"]
[4109,"ACREEDORES POR PRESTACIONES DE SERVICIOS, FACTURAS PENDIENTES DE RECIBIR O DE FORMALIZAR"]
[411,"ACREEDORES, EFECTOS COMERCIALES A PAGAR"]
[419,"ACREEDORES POR OPERACIONES EN COMÚN"]
["43.","CLIENTES"]
[430,"CLIENTES"]
[{"$f":"Franquicias!F2","v":"4300000091"},{"$f":"\"Clientes Franquiciado \"&Franquicias!B2","v":"Clientes Franquiciado Vimianzo SL"}]
[{"$f":"Franquicias!F3","v":"4300000092"},{"$f":"\"Clientes Franquiciado \"&Franquicias!B3","v":"Clientes Franquiciado Camariñas SL"}]
[{"$f":"Franquicias!F4","v":"4300000093"},{"$f":"\"Clientes Franquiciado \"&Franquicias!B4","v":"Clientes Franquiciado Muxía SL"}]
[{"$f":"Franquicias!F5","v":"4300000094"},{"$f":"\"Clientes Franquiciado \"&Franquicias!B5","v":"Clientes Franquiciado Costa da Morte SL"}]
[{"$f":"Franquicias!F6","v":"4300000095"},{"$f":"\"Clientes Franquiciado \"&Franquicias!B6","v":"Clientes Franquiciado Malpica SL"}]
[{"$f":"Franquicias!F7","v":"4300000096"},{"$f":"\"Clientes Franquiciado \"&Franquicias!B7","v":"Clientes Franquiciado Dumbría SL"}]
[4300000001,"CLIENTES (EUROS)"]
[4304,"CLIENTES, (MONEDA EXTRANJERA)"]
[4309,"CLIENTES, FACTURAS PENDIENTES DE FORMALIZAR"]
[431,"CLIENTES, EFECTOS COMERCIALES A COBRAR"]
[4310,"EFECTOS COMERCIALES EN CARTERA"]
[4311,"EFECTOS COMERCIALES DESCONTADOS"]
[4312,"EFECTOS COMERCIALES EN GESTIÓN DE COBRO"]
[4315,"EFECTOS COMERCIALES IMPAGADOS"]
[432,"CLIENTES, OPERACIONES DE \"FACTORING\""]
[433,"CLIENTES, EMPRESAS DEL GRUPO"]
[4330,"CLIENTES EMPRESAS DEL GRUPO (EUROS)"]
[4331,"EFECTOS COMERCIALES A COBRAR, EMPRESAS DEL GRUPO"]
[4332,"CLIENTES EMPRESAS DEL GRUPO, OPERACIONES DE \"FACTORING\""]
[4334,"CLIENTES EMPRESAS DEL GRUPO (MONEDA EXTRANJERA)"]
[4336,"CLIENTES EMPRESAS DEL GRUPO DE DUDOSO COBRO"]
[4337,"ENVASES Y EMBALAJES A DEVOLVER A CLIENTES, EMPRESAS DEL GRUPO"]
[4339,"CLIENTES EMPRESAS DEL GRUPO, FACTURAS PENDIENTES DE FORMALIZAR"]
[434,"CLIENTES, EMPRESAS ASOCIADAS"]
[435,"CLIENTES, OTRAS PARTES VINCULADAS"]
[436,"CLIENTES DE DUDOSO COBRO"]
[437,"ENVASES Y EMBALAJES A DEVOLVER POR CLIENTES"]
[438,"ANTICIPOS DE CLIENTES"]
["44.","DEUDORES VARIOS"]
[440,"DEUDORES"]
[{"$f":"Franquicias!G2","v":"4400000091"},{"$f":"\"Deudores Franquiciado \"&Franquicias!B2","v":"Deudores Franquiciado Vimianzo SL"}]
[{"$f":"Franquicias!G3","v":"4400000092"},{"$f":"\"Deudores Franquiciado \"&Franquicias!B3","v":"Deudores Franquiciado Camariñas SL"}]
[{"$f":"Franquicias!G4","v":"4400000093"},{"$f":"\"Deudores Franquiciado \"&Franquicias!B4","v":"Deudores Franquiciado Muxía SL"}]
[{"$f":"Franquicias!G5","v":"4400000094"},{"$f":"\"Deudores Franquiciado \"&Franquicias!B5","v":"Deudores Franquiciado Costa da Morte SL"}]
[{"$f":"Franquicias!G6","v":"4400000095"},{"$f":"\"Deudores Franquiciado \"&Franquicias!B6","v":"Deudores Franquiciado Malpica SL"}]
[{"$f":"Franquicias!G7","v":"4400000096"},{"$f":"\"Deudores Franquiciado \"&Franquicias!B7","v":"Deudores Franquiciado Dumbría SL"}]
[4400,"DEUDORES (EUROS)"]
[4404,"DEUDORES (MONEDA EXTRANJERA)"]
[4409,"DEUDORES, FACTURAS PENDIENTES DE FORMALIZAR"]
[441,"DEUDORES, EFECTOS COMERCIALES A COBRAR"]
[4410,"DEUDORES, EFECTOS COMERCIALES EN CARTERA"]
[4411,"DEUDORES, EFECTOS COMERCIALES DESCONTADOS"]
[4412,"DEUDORES, EFECTOS COMERCIALES EN GESTIÓN DE COBRO"]
[4415,"DEUDORES, EFECTOS COMERCIALES IMPAGADOS"]
[446,"DEUDORES DE DUDOSO COBRO"]
[449,"DEUDORES POR OPERACIONES EN COMÚN"]
["46.","PERSONAL"]
[4600000001,"ANTICIPOS DE REMUNERACIONES"]
[4650000001,"REMUNERACIONES PENDIENTES DE PAGO"]
["47.","ADMINISTRACIONES PÚBLICAS"]
[470,"HACIENDA PÚBLICA, DEUDORA POR DIVERSOS CONCEPTOS"]
[4700000001,"HACIENDA PÚBLICA, DEUDORA POR IVA"]
[4708,"HACIENDA PÚBLICA, DEUDORA POR SUBVENCIONES CONCEDIDAS"]
[4709,"HACIENDA PÚBLICA, DEUDORA POR DEVOLUCIÓN DE IMPUESTOS"]
[4710000001,"ORGANISMOS DE LA SEGURIDAD SOCIAL, DEUDORES (Ss que paga empresa)"]
[472,"HACIENDA PÚBLICA, IVA SOPORTADO"]
[4720000004,"Hacienda pública, IVA soportado 4%"]
[4720000021,"Hacienda pública, IVA soportado 21%"]
[4720000001,"Hacienda pública, IVA soportado 10%"]
[4730000001,"HACIENDA PÚBLICA, RETENCIONES Y PAGOS A CUENTA"]
[4740000001,"ACTIVOS POR IMPUESTO DIFERIDO"]
[4741000001,"ACTIVOS POR DIFERENCIAS TEMPORARIAS DEDUCIBLES"]
[4742,"DERECHOS POR DEDUCCIONES Y BONIFICACIONES PENDIENTES DE APLICAR"]
[4745,"CRÉDITO POR PÉRDIDAS A COMPENSAR DEL EJERCICIO"]
[475,"HACIENDA PÚBLICA, ACREEDORA POR CONCEPTOS FISCALES"]
[4750000001,"HACIENDA PÚBLICA, ACREEDORA POR IVA"]
[4751000001,"HACIENDA PÚBLICA, ACREEDORA POR RETENCIONES PRACTICADAS"]
[4752000001,"HACIENDA PÚBLICA, ACREEDORA POR IMPUESTO SOBRE SOCIEDADES"]
[4758,"HACIENDA PÚBLICA, ACREEDORA POR SUBVENCIONES A REINTEGRAR"]
[4760000001,"ORGANISMOS DE LA SEGURIDAD SOCIAL, ACREEDORES"]
[477,"HACIENDA PÚBLICA, IVA REPERCUTIDO"]
[{"$f":"Familias!D4","v":"4770000400"},"Hacienda pública, IVA repercutido 4%"]
[{"$f":"Familias!D5","v":"4770002100"},"Hacienda pública, IVA repercutido 21%"]
[{"$f":"TEXT(4770001000,\"0000000000\")","v":"4770001000"},"Hacienda pública, IVA repercutido 10%"]
[4790000001,"PASIVOS POR DIFERENCIAS TEMPORARIAS IMPONIBLES"]
["48.","AJUSTES POR PERIODIFICACIÓN"]
[480,"GASTOS ANTICIPADOS"]
[4800000001,"Gastos anticipados seguros "]
[4800000002,"Gastos anticipados mutuas"]
[485,"INGRESOS ANTICIPADOS"]
[4850000001,"Otros ingresos anticipados"]
["49.","DETERIORO DE VALOR DE CRÉDITOS POR OPERACIONES COMERCIALES Y PROVISIONES A CORTO PLAZO"]
[490,"DETERIORO DE VALOR DE CRÉDITOS POR OPERACIONES COMERCIALES"]
[493,"DETERIORO DE VALOR DE CRÉDITOS POR OPERACIONES COMERCIALES CON PARTES VINCULADAS"]
[4933,"DETERIORO DE VALOR DE CRÉDITOS POR OPERACIONES COMERCIALES CON EMPRESAS DEL GRUPO"]
[4934,"DETERIORO DE VALOR DE CRÉDITOS POR OPERACIONES COMERCIALES CON EMPRESAS ASOCIADAS"]
[4935,"DETERIORO DE VALOR DE CRÉDITOS POR OPERACIONES COMERCIALES CON OTRAS PARTES VINCULADAS"]
[499,"PROVISIONES POR OPERACIONES COMERCIALES"]
[4994,"PROVISIÓN POR CONTRATOS ONEROSOS"]
[4999,"PROVISIÓN PARA OTRAS OPERACIONES COMERCIALES"]
["GRUPO 5","CUENTAS FINANCIERAS"]
["50.","EMPRÉSTITOS, DEUDAS CON CARACTERÍSTICAS ESPECIALES Y OTRAS EMISIONES ANÁLOGAS A CORTO PLAZO"]
[500,"OBLIGACIONES Y BONOS A CORTO PLAZO"]
[502,"ACCIONES O PARTICIPACIONES A CORTO PLAZO CONSIDERADAS COMO PASIVOS FINANCIEROS"]
[505,"DEUDAS REPRESENTADAS EN OTROS VALORES NEGOCIABLES A CORTO PLAZO"]
[506,"INTERESES A CORTO PLAZO DE EMPRÉSTITOS Y OTRAS EMISIONES ANÁLOGAS"]
[507,"DIVIDENDOS DE ACCIONES O PARTICIPACIONES CONSIDERADAS COMO PASIVOS FINANCIEROS"]
[509,"VALORES NEGOCIABLES AMORTIZADOS"]
[5090,"OBLIGACIONES Y BONOS AMORTIZADOS"]
[5095,"OTROS VALORES NEGOCIABLES AMORTIZADOS"]
["51.","DEUDAS A CORTO PLAZO CON PARTES VINCULADAS"]
[510,"DEUDAS A CORTO PLAZO CON ENTIDADES DE CRÉDITO VINCULADAS"]
[5103,"DEUDAS A CORTO PLAZO CON ENTIDADES DE CRÉDITO, EMPRESAS DEL GRUPO"]
[5104,"DEUDAS A CORTO PLAZO CON ENTIDADES DE CRÉDITO, EMPRESAS ASOCIADAS"]
[5105,"DEUDAS A CORTO PLAZO CON OTRAS ENTIDADES DE CRÉDITO VINCULADAS"]
[511,"PROVEEDORES DE INMOVILIZADO A CORTO PLAZO, PARTES VINCULADAS"]
[5113,"PROVEEDORES DE INMOVILIZADO A CORTO PLAZO, EMPRESAS DEL GRUPO"]
[5114,"PROVEEDORES DE INMOVILIZADO A CORTO PLAZO, EMPRESAS ASOCIADAS"]
[5115,"PROVEEDORES DE INMOVILIZADO A CORTO PLAZO, OTRAS PARTES VINCULADAS"]
[512,"ACREEDORES POR ARRENDAMIENTO FINANCIERO A CORTO PLAZO, PARTES VINCULADAS"]
[5123,"ACREEDORES POR ARRENDAMIENTO FINANCIERO A CORTO PLAZO, EMPRESAS DEL GRUPO"]
[5124,"ACREEDORES POR ARRENDAMIENTO FINANCIERO A CORTO PLAZO, EMPRESAS ASOCIADAS"]
[5125,"ACREEDORES POR ARRENDAMIENTO FINANCIERO A CORTO PLAZO, OTRAS PARTES VINCULADAS"]
[513,"OTRAS DEUDAS A CORTO PLAZO CON PARTES VINCULADAS"]
[5133,"OTRAS DEUDAS A CORTO PLAZO CON EMPRESAS DEL GRUPO"]
[5134,"OTRAS DEUDAS A CORTO PLAZO CON EMPRESAS ASOCIADAS"]
[5135,"OTRAS DEUDAS A CORTO PLAZO CON OTRAS PARTES VINCULADAS"]
[514,"INTERESES A CORTO PLAZO DE DEUDAS CON PARTES VINCULADAS"]
[5143,"INTERESES A CORTO PLAZO DE DEUDAS, EMPRESAS DEL GRUPO"]
[5144,"INTERESES A CORTO PLAZO DE DEUDAS, EMPRESAS ASOCIADAS"]
[5145,"INTERESES A CORTO PLAZO DE DEUDAS, OTRAS PARTES VINCULADAS"]
["52.","DEUDAS A CORTO PLAZO POR PRÉSTAMOS RECIBIDOS Y OTROS CONCEPTOS"]
[520,"DEUDAS A CORTO PLAZO CON ENTIDADES DE CRÉDITO"]
[5200000001,"PRÉSTAMOS A CORTO PLAZO DE ENTIDADES DE CRÉDITO"]
[5201000001,"DEUDAS A CORTO PLAZO POR CRÉDITO DISPUESTO"]
[5208,"DEUDAS POR EFECTOS DESCONTADOS"]
[5209,"DEUDAS POR OPERACIONES DE \"FACTORING\""]
[5210000001,"DEUDAS A CORTO PLAZO"]
[5220000001,"DEUDAS A CORTO PLAZO TRANSFORMABLES EN SUBVENCIONES, DONACIONES Y LEGADOS"]
[523,"PROVEEDORES DE INMOVILIZADO A CORTO PLAZO"]
[524,"ACREEDORES POR ARRENDAMIENTO FINANCIERO A CORTO PLAZO."]
[525,"EFECTOS A PAGAR A CORTO PLAZO"]
[526,"DIVIDENDO ACTIVO A PAGAR"]
[5270000001,"INTERESES A CORTO PLAZO DE DEUDAS CON ENTIDADES DE CRÉDITO"]
[5280000001,"INTERESES A CORTO PLAZO DE DEUDAS"]
[529,"PROVISIONES A CORTO PLAZO"]
[5291,"PROVISIÓN A CORTO PLAZO PARA IMPUESTOS"]
[5292,"PROVISIÓN A CORTO PLAZO PARA OTRAS RESPONSABILIDADES"]
[5293,"PROVISIÓN A CORTO PLAZO POR DESMANTELAMIENTO, RETIRO O REHABILITACIÓN DEL INMOVILIZADO"]
[5295000001,"PROVISIÓN A CORTO PLAZO PARA ACTUACIONES MEDIOAMBIENTALES"]
["53.","INVERSIONES FINANCIERAS A CORTO PLAZO EN PARTES VINCULADAS"]
[530,"PARTICIPACIONES A CORTO PLAZO EN PARTES VINCULADAS"]
[5303,"PARTICIPACIONES A CORTO PLAZO, EN EMPRESAS DEL GRUPO"]
[5304,"PARTICIPACIONES A CORTO PLAZO, EN EMPRESAS ASOCIADAS"]
[5305,"PARTICIPACIONES A CORTO PLAZO, EN OTRAS PARTES VINCULADAS"]
[531,"VALORES REPRESENTATIVOS DE DEUDA A CORTO PLAZO DE PARTES VINCULADAS"]
[5313,"VALORES REPRESENTATIVOS DE DEUDA A CORTO PLAZO DE EMPRESAS DEL GRUPO"]
[5314,"VALORES REPRESENTATIVOS DE DEUDA A CORTO PLAZO DE EMPRESAS ASOCIADAS"]
[5315,"VALORES REPRESENTATIVOS DE DEUDA A CORTO PLAZO DE OTRAS PARTES VINCULADAS"]
[532,"CRÉDITOS A CORTO PLAZO A PARTES VINCULADAS"]
[5323,"CRÉDITOS A CORTO PLAZO A EMPRESAS DEL GRUPO"]
[5324,"CRÉDITOS A CORTO PLAZO A EMPRESAS ASOCIADAS"]
[5325,"CRÉDITOS A CORTO PLAZO A OTRAS PARTES VINCULADAS"]
[533,"INTERESES A CORTO PLAZO DE VALORES REPRESENTATIVOS DE DEUDA EN PARTES VINCULADAS"]
[5333,"INTERESES A CORTO PLAZO DE VALORES REPRESENTATIVOS DE DEUDA EN EMPRESAS DEL GRUPO"]
[5334,"INTERESES A CORTO PLAZO DE VALORES REPRESENTATIVOS DE DEUDA EN EMPRESAS ASOCIADAS"]
[5335,"INTERESES A CORTO PLAZO DE VALORES REPRESENTATIVOS DE DEUDA EN OTRAS PARTES VINCULADAS"]
[534,"INTERESES A CORTO PLAZO DE CRÉDITOS A PARTES VINCULADAS"]
[5343,"INTERESES A CORTO PLAZO DE CRÉDITOS A EMPRESAS DEL GRUPO"]
[5344,"INTERESES A CORTO PLAZO DE CRÉDITOS A EMPRESAS ASOCIADAS"]
[5345,"INTERESES A CORTO PLAZO DE CRÉDITOS A OTRAS PARTES VINCULADAS"]
[535,"DIVIDENDO A COBRAR DE INVERSIONES FINANCIERAS EN PARTES VINCULADAS"]
[5353,"DIVIDENDO A COBRAR DE EMPRESAS DE GRUPO"]
[5354,"DIVIDENDO A COBRAR DE EMPRESAS ASOCIADAS"]
[5355,"DIVIDENDO A COBRAR DE OTRAS PARTES VINCULADAS"]
[539,"DESEMBOLSOS PENDIENTES SOBRE PARTICIPACIONES A CORTO PLAZO DE PARTES VINCULADAS"]
[5393,"DESEMBOLSOS PENDIENTES SOBRE PARTICIPACIONES A CORTO PLAZO EN EMPRESAS DEL GRUPO"]
[5394,"DESEMBOLSOS PENDIENTES SOBRE PARTICIPACIONES A CORTO PLAZO EN EMPRESAS ASOCIADAS"]
[5395,"DESEMBOLSOS PENDIENTES SOBRE PARTICIPACIONES A CORTO PLAZO EN OTRAS PARTES VINCULADAS"]
["54.","OTRAS INVERSIONES FINANCIERAS A CORTO PLAZO"]
[540,"INVERSIONES FINANCIERAS A CORTO PLAZO EN INSTRUMENTOS DE PATRIMONIO"]
[541,"VALORES REPRESENTATIVOS DE DEUDA A CORTO PLAZO"]
[542,"CRÉDITOS A CORTO PLAZO"]
[543,"CRÉDITOS A CORTO PLAZO POR ENAJENACIÓN DE INMOVILIZADO"]
[544,"CRÉDITOS A CORTO PLAZO AL PERSONAL"]
[545,"DIVIDENDO A COBRAR"]
[546,"INTERESES A CORTO PLAZO DE VALORES REPRESENTATIVOS DE DEUDA"]
[547,"INTERESES A CORTO PLAZO DE CRÉDITOS"]
[548,"IMPOSICIONES A CORTO PLAZO"]
[549,"DESEMBOLSOS PENDIENTES SOBRE PARTICIPACIONES EN EL PATRIMONIO NETO A CORTO PLAZO"]
["55.","OTRAS CUENTAS NO BANCARIAS"]
[550,"TITULAR DE LA EXPLOTACIÓN"]
[551,"CUENTA CORRIENTE CON SOCIOS Y ADMINISTRADO-RES"]
[552,"CUENTA CORRIENTE CON OTRAS PERSONAS Y ENTIDADES VINCULADAS"]
[5523,"CUENTA CORRIENTE CON EMPRESAS DEL GRUPO"]
[5524,"CUENTA CORRIENTE CON EMPRESAS ASOCIADAS"]
[5525,"CUENTA CORRIENTE CON OTRAS PARTES VINCULADAS"]
[554,"CUENTA CORRIENTE CON UNIONES TEMPORALES DE EMPRESAS Y COMUNIDADES DE BIENES"]
[555,"PARTIDAS PENDIENTES DE APLICACIÓN"]
[556,"DESEMBOLSOS EXIGIDOS SOBRE PARTICIPACIONES EN EL PATRIMONIO NETO"]
[5563,"DESEMBOLSOS EXIGIDOS SOBRE PARTICIPACIONES, EMPRESAS DEL GRUPO"]
[5564,"DESEMBOLSOS EXIGIDOS SOBRE PARTICIPACIONES, EMPRESAS ASOCIADAS"]
[5565,"DESEMBOLSOS EXIGIDOS SOBRE PARTICIPACIONES, OTRAS PARTES VINCULADAS"]
[5566,"DESEMBOLSOS EXIGIDOS SOBRE PARTICIPACIONES DE OTRAS EMPRESAS"]
[557,"DIVIDENDO ACTIVO A CUENTA"]
[558,"SOCIOS POR DESEMBOLSOS EXIGIDOS"]
[5580,"SOCIOS POR DESEMBOLSOS EXIGIDOS SOBRE ACCIONES O PARTICIPACIONES ORDINARIAS"]
[5585,"SOCIOS POR DESEMBOLSOS EXIGIDOS SOBRE ACCIONES O PARTICIPACIONES CONSIDERADAS COMO PASIVOS FINANCIEROS"]
[559,"DERIVADOS FINANCIEROS A CORTO PLAZO"]
[5590,"ACTIVOS POR DERIVADOS FINANCIEROS A CORTO PLAZO"]
[5595,"PASIVOS POR DERIVADOS FINANCIEROS A CORTO PLAZO"]
["56.","FIANZAS Y DEPÓSITOS RECIBIDOS Y CONSTITUÍDOS A CORTO PLAZO Y AJUSTES POR PERIODIFICACIÓN"]
[560,"FIANZAS RECIBIDAS A CORTO PLAZO"]
[561,"DEPÓSITOS RECIBIDOS A CORTO PLAZO"]
[565,"FIANZAS CONSTITUIDAS A CORTO PLAZO"]
[566,"DEPÓSITOS CONSTITUIDOS A CORTO PLAZO"]
[567,"INTERESES PAGADOS POR ANTICIPADO"]
[568,"INTERESES COBRADOS POR ANTICIPADO"]
["57.","TESORERÍA"]
[570,"CAJA, EUROS"]
[{"$f":"Tiendas!G2","v":"5700000011"},{"$f":"\"Caja tienda\"&\" \"&Tiendas!B2","v":"Caja tienda A Coruña 1"}]
[{"$f":"Tiendas!G3","v":"5700000012"},{"$f":"\"Caja tienda\"&\" \"&Tiendas!B3","v":"Caja tienda A Coruña 2"}]
[{"$f":"Tiendas!G4","v":"5700000013"},{"$f":"\"Caja tienda\"&\" \"&Tiendas!B4","v":"Caja tienda A Coruña 3"}]
[{"$f":"Tiendas!G5","v":"5700000014"},{"$f":"\"Caja tienda\"&\" \"&Tiendas!B5","v":"Caja tienda A Coruña 4"}]
[{"$f":"Tiendas!G6","v":"5700000015"},{"$f":"\"Caja tienda\"&\" \"&Tiendas!B6","v":"Caja tienda A Coruña 5"}]
[{"$f":"Tiendas!G7","v":"5700000021"},{"$f":"\"Caja tienda\"&\" \"&Tiendas!B7","v":"Caja tienda Lugo 1"}]
[{"$f":"Tiendas!G8","v":"5700000022"},{"$f":"\"Caja tienda\"&\" \"&Tiendas!B8","v":"Caja tienda Lugo 2"}]
[{"$f":"Tiendas!G9","v":"5700000031"},{"$f":"\"Caja tienda\"&\" \"&Tiendas!B9","v":"Caja tienda Ourense 1"}]
[{"$f":"Tiendas!G10","v":"5700000032"},{"$f":"\"Caja tienda\"&\" \"&Tiendas!B10","v":"Caja tienda Ourense 2"}]
[{"$f":"Tiendas!G11","v":"5700000033"},{"$f":"\"Caja tienda\"&\" \"&Tiendas!B11","v":"Caja tienda Ourense 3"}]
[{"$f":"Tiendas!G12","v":"5700000041"},{"$f":"\"Caja tienda\"&\" \"&Tiendas!B12","v":"Caja tienda Pontevedra 1"}]
[{"$f":"Tiendas!G13","v":"5700000042"},{"$f":"\"Caja tienda\"&\" \"&Tiendas!B13","v":"Caja tienda Pontevedra 2"}]
[{"$f":"Tiendas!G14","v":"5700000043"},{"$f":"\"Caja tienda\"&\" \"&Tiendas!B14","v":"Caja tienda Pontevedra 3"}]
[{"$f":"Tiendas!G15","v":"5700000044"},{"$f":"\"Caja tienda\"&\" \"&Tiendas!B15","v":"Caja tienda Pontevedra 4"}]
[{"$f":"Tiendas!G16","v":"5700000051"},{"$f":"\"Caja tienda\"&\" \"&Tiendas!B16","v":"Caja tienda Madrid 1"}]
[{"$f":"Tiendas!G17","v":"5700000052"},{"$f":"\"Caja tienda\"&\" \"&Tiendas!B17","v":"Caja tienda Madrid 2"}]
[{"$f":"Tiendas!G18","v":"5700000053"},{"$f":"\"Caja tienda\"&\" \"&Tiendas!B18","v":"Caja tienda Madrid 3"}]
[{"$f":"Tiendas!G19","v":"5700000054"},{"$f":"\"Caja tienda\"&\" \"&Tiendas!B19","v":"Caja tienda Madrid 4"}]
[{"$f":"Tiendas!G20","v":"5700000055"},{"$f":"\"Caja tienda\"&\" \"&Tiendas!B20","v":"Caja tienda Madrid 5"}]
[{"$f":"Tiendas!G21","v":"5700000061"},{"$f":"\"Caja tienda\"&\" \"&Tiendas!B21","v":"Caja tienda Barcelona 1"}]
[{"$f":"Tiendas!G22","v":"5700000062"},{"$f":"\"Caja tienda\"&\" \"&Tiendas!B22","v":"Caja tienda Barcelona 2"}]
[{"$f":"Tiendas!G23","v":"5700000063"},{"$f":"\"Caja tienda\"&\" \"&Tiendas!B23","v":"Caja tienda Barcelona 3"}]
[{"$f":"Tiendas!G24","v":"5700000064"},{"$f":"\"Caja tienda\"&\" \"&Tiendas!B24","v":"Caja tienda Barcelona 4"}]
[{"$f":"Tiendas!G25","v":"5700000071"},{"$f":"\"Caja tienda\"&\" \"&Tiendas!B25","v":"Caja tienda Bilbao 1"}]
[{"$f":"Tiendas!G26","v":"5700000072"},{"$f":"\"Caja tienda\"&\" \"&Tiendas!B26","v":"Caja tienda Bilbao 2"}]
[{"$f":"Tiendas!G27","v":"570000080"},{"$f":"\"Caja tienda\"&\" \"&Tiendas!B27","v":"Caja tienda Almacén"}]
[571,"CAJA, MONEDA EXTRANJERA"]
[572,"BANCOS E INSTITUCIONES DE CRÉDITO C/C VISTA, EUROS"]
[572001,"Bancos. Pago efectivo"]
[{"$f":"Tiendas!J2","v":"5720010003"},{"$f":"\"Bancos. Pago efectivo tienda\"&\" \"&Tiendas!B2","v":"Bancos. Pago efectivo tienda A Coruña 1"}]
[{"$f":"Tiendas!J3","v":"5720010003"},{"$f":"\"Bancos. Pago efectivo tienda\"&\" \"&Tiendas!B3","v":"Bancos. Pago efectivo tienda A Coruña 2"}]
[{"$f":"Tiendas!J4","v":"5720010003"},{"$f":"\"Bancos. Pago efectivo tienda\"&\" \"&Tiendas!B4","v":"Bancos. Pago efectivo tienda A Coruña 3"}]
[{"$f":"Tiendas!J5","v":"5720010003"},{"$f":"\"Bancos. Pago efectivo tienda\"&\" \"&Tiendas!B5","v":"Bancos. Pago efectivo tienda A Coruña 4"}]
[{"$f":"Tiendas!J6","v":"5720010002"},{"$f":"\"Bancos. Pago efectivo tienda\"&\" \"&Tiendas!B6","v":"Bancos. Pago efectivo tienda A Coruña 5"}]
[{"$f":"Tiendas!J7","v":"5720010003"},{"$f":"\"Bancos. Pago efectivo tienda\"&\" \"&Tiendas!B7","v":"Bancos. Pago efectivo tienda Lugo 1"}]
[{"$f":"Tiendas!J8","v":"5720010003"},{"$f":"\"Bancos. Pago efectivo tienda\"&\" \"&Tiendas!B8","v":"Bancos. Pago efectivo tienda Lugo 2"}]
[{"$f":"Tiendas!J9","v":"5720010003"},{"$f":"\"Bancos. Pago efectivo tienda\"&\" \"&Tiendas!B9","v":"Bancos. Pago efectivo tienda Ourense 1"}]
[{"$f":"Tiendas!J10","v":"5720010001"},{"$f":"\"Bancos. Pago efectivo tienda\"&\" \"&Tiendas!B10","v":"Bancos. Pago efectivo tienda Ourense 2"}]
[{"$f":"Tiendas!J11","v":"5720010001"},{"$f":"\"Bancos. Pago efectivo tienda\"&\" \"&Tiendas!B11","v":"Bancos. Pago efectivo tienda Ourense 3"}]
[{"$f":"Tiendas!J12","v":"5720010003"},{"$f":"\"Bancos. Pago efectivo tienda\"&\" \"&Tiendas!B12","v":"Bancos. Pago efectivo tienda Pontevedra 1"}]
[{"$f":"Tiendas!J13","v":"5720010003"},{"$f":"\"Bancos. Pago efectivo tienda\"&\" \"&Tiendas!B13","v":"Bancos. Pago efectivo tienda Pontevedra 2"}]
[{"$f":"Tiendas!J14","v":"5720010002"},{"$f":"\"Bancos. Pago efectivo tienda\"&\" \"&Tiendas!B14","v":"Bancos. Pago efectivo tienda Pontevedra 3"}]
[{"$f":"Tiendas!J15","v":"5720010003"},{"$f":"\"Bancos. Pago efectivo tienda\"&\" \"&Tiendas!B15","v":"Bancos. Pago efectivo tienda Pontevedra 4"}]
[{"$f":"Tiendas!J16","v":"5720010001"},{"$f":"\"Bancos. Pago efectivo tienda\"&\" \"&Tiendas!B16","v":"Bancos. Pago efectivo tienda Madrid 1"}]
[{"$f":"Tiendas!J17","v":"5720010001"},{"$f":"\"Bancos. Pago efectivo tienda\"&\" \"&Tiendas!B17","v":"Bancos. Pago efectivo tienda Madrid 2"}]
[{"$f":"Tiendas!J18","v":"5720010002"},{"$f":"\"Bancos. Pago efectivo tienda\"&\" \"&Tiendas!B18","v":"Bancos. Pago efectivo tienda Madrid 3"}]
[{"$f":"Tiendas!J19","v":"5720010005"},{"$f":"\"Bancos. Pago efectivo tienda\"&\" \"&Tiendas!B19","v":"Bancos. Pago efectivo tienda Madrid 4"}]
[{"$f":"Tiendas!J20","v":"5720010005"},{"$f":"\"Bancos. Pago efectivo tienda\"&\" \"&Tiendas!B20","v":"Bancos. Pago efectivo tienda Madrid 5"}]
[{"$f":"Tiendas!J21","v":"5720010006"},{"$f":"\"Bancos. Pago efectivo tienda\"&\" \"&Tiendas!B21","v":"Bancos. Pago efectivo tienda Barcelona 1"}]
[{"$f":"Tiendas!J22","v":"5720010006"},{"$f":"\"Bancos. Pago efectivo tienda\"&\" \"&Tiendas!B22","v":"Bancos. Pago efectivo tienda Barcelona 2"}]
[{"$f":"Tiendas!J23","v":"5720010006"},{"$f":"\"Bancos. Pago efectivo tienda\"&\" \"&Tiendas!B23","v":"Bancos. Pago efectivo tienda Barcelona 3"}]
[{"$f":"Tiendas!J24","v":"5720010004"},{"$f":"\"Bancos. Pago efectivo tienda\"&\" \"&Tiendas!B24","v":"Bancos. Pago efectivo tienda Barcelona 4"}]
[{"$f":"Tiendas!J25","v":"5720010004"},{"$f":"\"Bancos. Pago efectivo tienda\"&\" \"&Tiendas!B25","v":"Bancos. Pago efectivo tienda Bilbao 1"}]
[{"$f":"Tiendas!J26","v":"5720010004"},{"$f":"\"Bancos. Pago efectivo tienda\"&\" \"&Tiendas!B26","v":"Bancos. Pago efectivo tienda Bilbao 2"}]
[{"$f":"Tiendas!J27","v":"5720010002"},{"$f":"\"Bancos. Pago efectivo tienda\"&\" \"&Tiendas!B27","v":"Bancos. Pago efectivo tienda Almacén"}]
[{"$f":"Tiendas!K2","v":"5720020001"},"Bancos. Pagos tarjetas"]
[573,"BANCOS E INSTITUCIONES DE CRÉDITO C/C VISTA, MONEDA EXTRANJERA"]
[574,"BANCOS E INSTITUCIONES DE CRÉDITO, CUENTAS DE AHORRO, EUROS"]
[575,"BANCOS E INSTITUCIONES DE CRÉDITO, CUENTAS DE AHORRO, MONEDA EXTRANJERA"]
[576,"INVERSIONES A CORTO PLAZO DE GRAN LIQUIDEZ"]
["59.","DETERIORO DEL VALOR DE INVERSIONES FINANCIERAS A CORTO PLAZO"]
[593,"DETERIORO DE VALOR DE PARTICIPACIONES A CORTO PLAZO EN PARTES VINCULADAS"]
[5933,"DETERIORO DE VALOR DE PARTICIPACIONES A CORTO PLAZO EN EMPRESAS DEL GRUPO"]
[5934,"DETERIORO DE VALOR DE PARTICIPACIONES A CORTO PLAZO EN EMPRESAS ASOCIADAS"]
[5935,"DETERIORO DE VALOR DE PARTICIPACIONES A CORTO PLAZO EN OTRAS PARTES VINCULADAS"]
[594,"DETERIORO DE VALOR DE VALORES REPRESENTATIVOS DE DEUDA A CORTO PLAZO DE PARTES VINCULADAS"]
[5943,"DETERIORO DE VALOR DE VALORES REPRESENTATIVOS DE DEUDA A CORTO PLAZO DE EMPRESAS DEL GRUPO"]
[5944,"DETERIORO DE VALOR DE VALORES REPRESENTATIVOS DE DEUDA A CORTO PLAZO DE EMPRESAS ASOCIADAS"]
[5945,"DETERIORO DE VALOR DE VALORES REPRESENTATIVOS DE DEUDA A CORTO PLAZO DE OTRAS PARTES VINCULADAS"]
[595,"DETERIORO DE VALOR DE CRÉDITOS A CORTO PLAZO A PARTES VINCULADAS"]
[5953,"DETERIORO DE VALOR DE CRÉDITOS A CORTO PLAZO A EMPRESAS DEL GRUPO"]
[5954,"DETERIORO DE VALOR DE CRÉDITOS A CORTO PLAZO A EMPRESAS ASOCIADAS"]
[5955,"DETERIORO DE VALOR DE CRÉDITOS A CORTO PLAZO A OTRAS PARTES VINCULADAS"]
[596,"DETERIORO DE VALOR DE PARTICIPACIONES A CORTO PLAZO"]
[597,"DETERIORO DE VALOR DE VALORES REPRESENTATIVOS DE DEUDA A CORTO PLAZO"]
[598,"DETERIORO DE VALOR DE CRÉDITOS A CORTO PLAZO"]
["GRUPO 6","COMPRAS Y GASTOS"]
["60.","COMPRAS"]
[600,"COMPRAS DE MERCADERÍAS"]
[{"$f":"\"6000000\"&Familias!A3","v":"6000000111"},{"$f":"\"Compras producto\"&\" \"&Familias!B3","v":"Compras producto Mar"}]
[{"$f":"\"6000000\"&Familias!A4","v":"6000000112"},{"$f":"\"Compras producto\"&\" \"&Familias!B4","v":"Compras producto Campo"}]
[{"$f":"\"6000000\"&Familias!A5","v":"6000000113"},{"$f":"\"Compras producto\"&\" \"&Familias!B5","v":"Compras producto Bebidas"}]
[{"$f":"\"6000000\"&Familias!A6","v":"6000000121"},{"$f":"\"Compras producto\"&\" \"&Familias!B6","v":"Compras producto Cerámicas"}]
[{"$f":"\"6000000\"&Familias!A7","v":"6000000122"},{"$f":"\"Compras producto\"&\" \"&Familias!B7","v":"Compras producto Encaje"}]
[{"$f":"\"6000000\"&Familias!A8","v":"6000000123"},{"$f":"\"Compras producto\"&\" \"&Familias!B8","v":"Compras producto Cuero"}]
[601,"COMPRAS DE MATERIAS PRIMAS"]
[602,"COMPRAS DE OTROS APROVISIONAMIENTOS"]
[606,"DESCUENTOS SOBRE COMPRAS POR PRONTO PAGO"]
[6060,"DESCUENTOS SOBRE COMPRAS POR PRONTO PAGO DE MERCANDERÍAS"]
[{"$f":"\"6060000\"&Familias!A3","v":"6060000111"},{"$f":"\"Descuentos por pronto pago producto\"&\" \"&Familias!B3","v":"Descuentos por pronto pago producto Mar"}]
[{"$f":"\"6060000\"&Familias!A4","v":"6060000112"},{"$f":"\"Descuentos por pronto pago producto\"&\" \"&Familias!B4","v":"Descuentos por pronto pago producto Campo"}]
[{"$f":"\"6060000\"&Familias!A5","v":"6060000113"},{"$f":"\"Descuentos por pronto pago producto\"&\" \"&Familias!B5","v":"Descuentos por pronto pago producto Bebidas"}]
[{"$f":"\"6060000\"&Familias!A6","v":"6060000121"},{"$f":"\"Descuentos por pronto pago producto\"&\" \"&Familias!B6","v":"Descuentos por pronto pago producto Cerámicas"}]
[{"$f":"\"6060000\"&Familias!A7","v":"6060000122"},{"$f":"\"Descuentos por pronto pago producto\"&\" \"&Familias!B7","v":"Descuentos por pronto pago producto Encaje"}]
[{"$f":"\"6060000\"&Familias!A8","v":"6060000123"},{"$f":"\"Descuentos por pronto pago producto\"&\" \"&Familias!B8","v":"Descuentos por pronto pago producto Cuero"}]
[6061,"DESCUENTOS SOBRE COMPRAS POR PRONTO PAGO DE MATERIAS PRIMAS"]
[6062,"DESCUENTOS SOBRE COMPRAS POR PRONTO PAGO DE OTROS APROVISIONAMIENTOS"]
[607,"TRABAJOS REALIZADOS POR OTRAS EMPRESAS"]
[608,"DEVOLUCIONES DE COMPRAS Y OPERACIONES SIMILARES"]
[6080,"DEVOLUCIONES DE COMPRAS DE MERCADERÍAS"]
[{"$f":"\"6080000\"&Familias!A3","v":"6080000111"},{"$f":"\"Devoluciones de compras producto\"&\" \"&Familias!B3","v":"Devoluciones de compras producto Mar"}]
[{"$f":"\"6080000\"&Familias!A4","v":"6080000112"},{"$f":"\"Devoluciones de compras producto\"&\" \"&Familias!B4","v":"Devoluciones de compras producto Campo"}]
[{"$f":"\"6080000\"&Familias!A5","v":"6080000113"},{"$f":"\"Devoluciones de compras producto\"&\" \"&Familias!B5","v":"Devoluciones de compras producto Bebidas"}]
[{"$f":"\"6080000\"&Familias!A6","v":"6080000121"},{"$f":"\"Devoluciones de compras producto\"&\" \"&Familias!B6","v":"Devoluciones de compras producto Cerámicas"}]
[{"$f":"\"6080000\"&Familias!A7","v":"6080000122"},{"$f":"\"Devoluciones de compras producto\"&\" \"&Familias!B7","v":"Devoluciones de compras producto Encaje"}]
[{"$f":"\"6080000\"&Familias!A8","v":"6080000123"},{"$f":"\"Devoluciones de compras producto\"&\" \"&Familias!B8","v":"Devoluciones de compras producto Cuero"}]
[6081,"DEVOLUCIONES DE COMPRAS DE MATERIAS PRIMAS"]
[6082,"DEVOLUCIONES DE COMPRAS DE OTROS APROVISIONAMIENTOS"]
[609,"RAPPELS POR COMPRAS"]
[6090,"RAPPELS POR COMPRAS DE MERCADERÍAS"]
[{"$f":"\"6090000\"&Familias!A3","v":"6090000111"},{"$f":"\"Rappels por compras producto\"&\" \"&Familias!B3","v":"Rappels por compras producto Mar"}]
[{"$f":"\"6090000\"&Familias!A4","v":"6090000112"},{"$f":"\"Rappels por compras producto\"&\" \"&Familias!B4","v":"Rappels por compras producto Campo"}]
[{"$f":"\"6090000\"&Familias!A5","v":"6090000113"},{"$f":"\"Rappels por compras producto\"&\" \"&Familias!B5","v":"Rappels por compras producto Bebidas"}]
[{"$f":"\"6090000\"&Familias!A6","v":"6090000121"},{"$f":"\"Rappels por compras producto\"&\" \"&Familias!B6","v":"Rappels por compras producto Cerámicas"}]
[{"$f":"\"6090000\"&Familias!A7","v":"6090000122"},{"$f":"\"Rappels por compras producto\"&\" \"&Familias!B7","v":"Rappels por compras producto Encaje"}]
[{"$f":"\"6090000\"&Familias!A8","v":"6090000123"},{"$f":"\"Rappels por compras producto\"&\" \"&Familias!B8","v":"Rappels por compras producto Cuero"}]
[6091,"RAPPELS POR COMPRAS DE MATERIAS PRIMAS"]
[6092,"RAPPELS POR COMPRAS DE OTROS APROVISIONAMIENTOS"]
["61.","VARIACIÓN DE EXISTENCIAS"]
[610,"VARIACIÓN DE EXISTENCIAS DE MERCADERÍAS"]
[{"$f":"\"6100000\"&Familias!A3","v":"6100000111"},{"$f":"\"Variación de existencias producto\"&\" \"&Familias!B3","v":"Variación de existencias producto Mar"}]
[{"$f":"\"6100000\"&Familias!A4","v":"6100000112"},{"$f":"\"Variación de existencias producto\"&\" \"&Familias!B4","v":"Variación de existencias producto Campo"}]
[{"$f":"\"6100000\"&Familias!A5","v":"6100000113"},{"$f":"\"Variación de existencias producto\"&\" \"&Familias!B5","v":"Variación de existencias producto Bebidas"}]
[{"$f":"\"6100000\"&Familias!A6","v":"6100000121"},{"$f":"\"Variación de existencias producto\"&\" \"&Familias!B6","v":"Variación de existencias producto Cerámicas"}]
[{"$f":"\"6100000\"&Familias!A7","v":"6100000122"},{"$f":"\"Variación de existencias producto\"&\" \"&Familias!B7","v":"Variación de existencias producto Encaje"}]
[{"$f":"\"6100000\"&Familias!A8","v":"6100000123"},{"$f":"\"Variación de existencias producto\"&\" \"&Familias!B8","v":"Variación de existencias producto Cuero"}]
[611,"VARIACIÓN DE EXISTENCIAS DE MATERIAS PRIMAS"]
[612,"VARIACIÓN DE EXISTENCIAS DE OTROS APROVISIONAMIENTOS"]
["62.","SERVICIOS EXTERIORES"]
[620,"GASTOS EN INVESTIGACIÓN Y DESARROLLO DEL EJERCICIO"]
[621,"ARRENDAMIENTOS Y CÁNONES"]
[{"$f":"\"62100000\"&Tiendas!A2","v":"6210000011"},{"$f":"\"Arrendamiento\"&\" \"&Tiendas!B2","v":"Arrendamiento A Coruña 1"}]
[{"$f":"\"62100000\"&Tiendas!A3","v":"6210000012"},{"$f":"\"Arrendamiento\"&\" \"&Tiendas!B3","v":"Arrendamiento A Coruña 2"}]
[{"$f":"\"62100000\"&Tiendas!A4","v":"6210000013"},{"$f":"\"Arrendamiento\"&\" \"&Tiendas!B4","v":"Arrendamiento A Coruña 3"}]
[{"$f":"\"62100000\"&Tiendas!A5","v":"6210000014"},{"$f":"\"Arrendamiento\"&\" \"&Tiendas!B5","v":"Arrendamiento A Coruña 4"}]
[{"$f":"\"62100000\"&Tiendas!A6","v":"6210000015"},{"$f":"\"Arrendamiento\"&\" \"&Tiendas!B6","v":"Arrendamiento A Coruña 5"}]
[{"$f":"\"62100000\"&Tiendas!A7","v":"6210000021"},{"$f":"\"Arrendamiento\"&\" \"&Tiendas!B7","v":"Arrendamiento Lugo 1"}]
[{"$f":"\"62100000\"&Tiendas!A8","v":"6210000022"},{"$f":"\"Arrendamiento\"&\" \"&Tiendas!B8","v":"Arrendamiento Lugo 2"}]
[{"$f":"\"62100000\"&Tiendas!A9","v":"6210000031"},{"$f":"\"Arrendamiento\"&\" \"&Tiendas!B9","v":"Arrendamiento Ourense 1"}]
[{"$f":"\"62100000\"&Tiendas!A10","v":"6210000032"},{"$f":"\"Arrendamiento\"&\" \"&Tiendas!B10","v":"Arrendamiento Ourense 2"}]
[{"$f":"\"62100000\"&Tiendas!A11","v":"6210000033"},{"$f":"\"Arrendamiento\"&\" \"&Tiendas!B11","v":"Arrendamiento Ourense 3"}]
[{"$f":"\"62100000\"&Tiendas!A12","v":"6210000041"},{"$f":"\"Arrendamiento\"&\" \"&Tiendas!B12","v":"Arrendamiento Pontevedra 1"}]
[{"$f":"\"62100000\"&Tiendas!A13","v":"6210000042"},{"$f":"\"Arrendamiento\"&\" \"&Tiendas!B13","v":"Arrendamiento Pontevedra 2"}]
[{"$f":"\"62100000\"&Tiendas!A14","v":"6210000043"},{"$f":"\"Arrendamiento\"&\" \"&Tiendas!B14","v":"Arrendamiento Pontevedra 3"}]
[{"$f":"\"62100000\"&Tiendas!A15","v":"6210000044"},{"$f":"\"Arrendamiento\"&\" \"&Tiendas!B15","v":"Arrendamiento Pontevedra 4"}]
[{"$f":"\"62100000\"&Tiendas!A16","v":"6210000051"},{"$f":"\"Arrendamiento\"&\" \"&Tiendas!B16","v":"Arrendamiento Madrid 1"}]
[{"$f":"\"62100000\"&Tiendas!A17","v":"6210000052"},{"$f":"\"Arrendamiento\"&\" \"&Tiendas!B17","v":"Arrendamiento Madrid 2"}]
[{"$f":"\"62100000\"&Tiendas!A18","v":"6210000053"},{"$f":"\"Arrendamiento\"&\" \"&Tiendas!B18","v":"Arrendamiento Madrid 3"}]
[{"$f":"\"62100000\"&Tiendas!A19","v":"6210000054"},{"$f":"\"Arrendamiento\"&\" \"&Tiendas!B19","v":"Arrendamiento Madrid 4"}]
[{"$f":"\"62100000\"&Tiendas!A20","v":"6210000055"},{"$f":"\"Arrendamiento\"&\" \"&Tiendas!B20","v":"Arrendamiento Madrid 5"}]
[{"$f":"\"62100000\"&Tiendas!A21","v":"6210000061"},{"$f":"\"Arrendamiento\"&\" \"&Tiendas!B21","v":"Arrendamiento Barcelona 1"}]
[{"$f":"\"62100000\"&Tiendas!A22","v":"6210000062"},{"$f":"\"Arrendamiento\"&\" \"&Tiendas!B22","v":"Arrendamiento Barcelona 2"}]
[{"$f":"\"62100000\"&Tiendas!A23","v":"6210000063"},{"$f":"\"Arrendamiento\"&\" \"&Tiendas!B23","v":"Arrendamiento Barcelona 3"}]
[{"$f":"\"62100000\"&Tiendas!A24","v":"6210000064"},{"$f":"\"Arrendamiento\"&\" \"&Tiendas!B24","v":"Arrendamiento Barcelona 4"}]
[{"$f":"\"62100000\"&Tiendas!A25","v":"6210000071"},{"$f":"\"Arrendamiento\"&\" \"&Tiendas!B25","v":"Arrendamiento Bilbao 1"}]
[{"$f":"\"62100000\"&Tiendas!A26","v":"6210000072"},{"$f":"\"Arrendamiento\"&\" \"&Tiendas!B26","v":"Arrendamiento Bilbao 2"}]
[{"$f":"\"62100000\"&Tiendas!A27","v":"6210000080"},{"$f":"\"Arrendamiento\"&\" \"&Tiendas!B27","v":"Arrendamiento Almacén"}]
[622,"REPARACIONES Y CONSERVACIÓN"]
[6220000001]
[623,"SERVICIOS DE PROFESIONALES INDEPENDIENTES"]
[6230000001,"Gestorías"]
[6230000002,"Notarios"]
[6230000003,"Abogados"]
[624,"TRANSPORTES"]
[6240000001,"Gto. Transportes"]
[625,"PRIMAS DE SEGUROS"]
[6250000001,"Gto. Primas de seguros"]
[626,"SERVICIOS BANCARIOS Y SIMILARES"]
[6260000001,"Servicios bancarios y similares"]
[627,"PUBLICIDAD, PROPAGANDA Y RELACIONES PÚBLICAS"]
[6270000001,"Publicidad, propaganda y relaciones públicas"]
[628,"SUMINISTROS"]
[{"$f":"\"62800100\"","v":"62800100"},"Agua"]
[{"$f":"\"62800100\"&Tiendas!A2","v":"6280010011"},{"$f":"\"Agua tienda\"&\" \"&Tiendas!B2","v":"Agua tienda A Coruña 1"}]
[{"$f":"\"62800100\"&Tiendas!A3","v":"6280010012"},{"$f":"\"Agua tienda\"&\" \"&Tiendas!B3","v":"Agua tienda A Coruña 2"}]
[{"$f":"\"62800100\"&Tiendas!A4","v":"6280010013"},{"$f":"\"Agua tienda\"&\" \"&Tiendas!B4","v":"Agua tienda A Coruña 3"}]
[{"$f":"\"62800100\"&Tiendas!A5","v":"6280010014"},{"$f":"\"Agua tienda\"&\" \"&Tiendas!B5","v":"Agua tienda A Coruña 4"}]
[{"$f":"\"62800100\"&Tiendas!A6","v":"6280010015"},{"$f":"\"Agua tienda\"&\" \"&Tiendas!B6","v":"Agua tienda A Coruña 5"}]
[{"$f":"\"62800100\"&Tiendas!A7","v":"6280010021"},{"$f":"\"Agua tienda\"&\" \"&Tiendas!B7","v":"Agua tienda Lugo 1"}]
[{"$f":"\"62800100\"&Tiendas!A8","v":"6280010022"},{"$f":"\"Agua tienda\"&\" \"&Tiendas!B8","v":"Agua tienda Lugo 2"}]
[{"$f":"\"62800100\"&Tiendas!A9","v":"6280010031"},{"$f":"\"Agua tienda\"&\" \"&Tiendas!B9","v":"Agua tienda Ourense 1"}]
[{"$f":"\"62800100\"&Tiendas!A10","v":"6280010032"},{"$f":"\"Agua tienda\"&\" \"&Tiendas!B10","v":"Agua tienda Ourense 2"}]
[{"$f":"\"62800100\"&Tiendas!A11","v":"6280010033"},{"$f":"\"Agua tienda\"&\" \"&Tiendas!B11","v":"Agua tienda Ourense 3"}]
[{"$f":"\"62800100\"&Tiendas!A12","v":"6280010041"},{"$f":"\"Agua tienda\"&\" \"&Tiendas!B12","v":"Agua tienda Pontevedra 1"}]
[{"$f":"\"62800100\"&Tiendas!A13","v":"6280010042"},{"$f":"\"Agua tienda\"&\" \"&Tiendas!B13","v":"Agua tienda Pontevedra 2"}]
[{"$f":"\"62800100\"&Tiendas!A14","v":"6280010043"},{"$f":"\"Agua tienda\"&\" \"&Tiendas!B14","v":"Agua tienda Pontevedra 3"}]
[{"$f":"\"62800100\"&Tiendas!A15","v":"6280010044"},{"$f":"\"Agua tienda\"&\" \"&Tiendas!B15","v":"Agua tienda Pontevedra 4"}]
[{"$f":"\"62800100\"&Tiendas!A16","v":"6280010051"},{"$f":"\"Agua tienda\"&\" \"&Tiendas!B16","v":"Agua tienda Madrid 1"}]
[{"$f":"\"62800100\"&Tiendas!A17","v":"6280010052"},{"$f":"\"Agua tienda\"&\" \"&Tiendas!B17","v":"Agua tienda Madrid 2"}]
[{"$f":"\"62800100\"&Tiendas!A18","v":"6280010053"},{"$f":"\"Agua tienda\"&\" \"&Tiendas!B18","v":"Agua tienda Madrid 3"}]
[{"$f":"\"62800100\"&Tiendas!A19","v":"6280010054"},{"$f":"\"Agua tienda\"&\" \"&Tiendas!B19","v":"Agua tienda Madrid 4"}]
[{"$f":"\"62800100\"&Tiendas!A20","v":"6280010055"},{"$f":"\"Agua tienda\"&\" \"&Tiendas!B20","v":"Agua tienda Madrid 5"}]
[{"$f":"\"62800100\"&Tiendas!A21","v":"6280010061"},{"$f":"\"Agua tienda\"&\" \"&Tiendas!B21","v":"Agua tienda Barcelona 1"}]
[{"$f":"\"62800100\"&Tiendas!A22","v":"6280010062"},{"$f":"\"Agua tienda\"&\" \"&Tiendas!B22","v":"Agua tienda Barcelona 2"}]
[{"$f":"\"62800100\"&Tiendas!A23","v":"6280010063"},{"$f":"\"Agua tienda\"&\" \"&Tiendas!B23","v":"Agua tienda Barcelona 3"}]
[{"$f":"\"62800100\"&Tiendas!A24","v":"6280010064"},{"$f":"\"Agua tienda\"&\" \"&Tiendas!B24","v":"Agua tienda Barcelona 4"}]
[{"$f":"\"62800100\"&Tiendas!A25","v":"6280010071"},{"$f":"\"Agua tienda\"&\" \"&Tiendas!B25","v":"Agua tienda Bilbao 1"}]
[{"$f":"\"62800100\"&Tiendas!A26","v":"6280010072"},{"$f":"\"Agua tienda\"&\" \"&Tiendas!B26","v":"Agua tienda Bilbao 2"}]
[{"$f":"\"62800100\"&Tiendas!A27","v":"6280010080"},{"$f":"\"Agua tienda\"&\" \"&Tiendas!B27","v":"Agua tienda Almacén"}]
[{"$f":"\"62800200\"","v":"62800200"},"Luz"]
[{"$f":"$A$853&Tiendas!A2","v":"6280020011"},{"$f":"\"Luz tienda\"&\" \"&Tiendas!B2","v":"Luz tienda A Coruña 1"}]
[{"$f":"$A$853&Tiendas!A3","v":"6280020012"},{"$f":"\"Luz tienda\"&\" \"&Tiendas!B3","v":"Luz tienda A Coruña 2"}]
[{"$f":"$A$853&Tiendas!A4","v":"6280020013"},{"$f":"\"Luz tienda\"&\" \"&Tiendas!B4","v":"Luz tienda A Coruña 3"}]
[{"$f":"$A$853&Tiendas!A5","v":"6280020014"},{"$f":"\"Luz tienda\"&\" \"&Tiendas!B5","v":"Luz tienda A Coruña 4"}]
[{"$f":"$A$853&Tiendas!A6","v":"6280020015"},{"$f":"\"Luz tienda\"&\" \"&Tiendas!B6","v":"Luz tienda A Coruña 5"}]
[{"$f":"$A$853&Tiendas!A7","v":"6280020021"},{"$f":"\"Luz tienda\"&\" \"&Tiendas!B7","v":"Luz tienda Lugo 1"}]
[{"$f":"$A$853&Tiendas!A8","v":"6280020022"},{"$f":"\"Luz tienda\"&\" \"&Tiendas!B8","v":"Luz tienda Lugo 2"}]
[{"$f":"$A$853&Tiendas!A9","v":"6280020031"},{"$f":"\"Luz tienda\"&\" \"&Tiendas!B9","v":"Luz tienda Ourense 1"}]
[{"$f":"$A$853&Tiendas!A10","v":"6280020032"},{"$f":"\"Luz tienda\"&\" \"&Tiendas!B10","v":"Luz tienda Ourense 2"}]
[{"$f":"$A$853&Tiendas!A11","v":"6280020033"},{"$f":"\"Luz tienda\"&\" \"&Tiendas!B11","v":"Luz tienda Ourense 3"}]
[{"$f":"$A$853&Tiendas!A12","v":"6280020041"},{"$f":"\"Luz tienda\"&\" \"&Tiendas!B12","v":"Luz tienda Pontevedra 1"}]
[{"$f":"$A$853&Tiendas!A13","v":"6280020042"},{"$f":"\"Luz tienda\"&\" \"&Tiendas!B13","v":"Luz tienda Pontevedra 2"}]
[{"$f":"$A$853&Tiendas!A14","v":"6280020043"},{"$f":"\"Luz tienda\"&\" \"&Tiendas!B14","v":"Luz tienda Pontevedra 3"}]
[{"$f":"$A$853&Tiendas!A15","v":"6280020044"},{"$f":"\"Luz tienda\"&\" \"&Tiendas!B15","v":"Luz tienda Pontevedra 4"}]
[{"$f":"$A$853&Tiendas!A16","v":"6280020051"},{"$f":"\"Luz tienda\"&\" \"&Tiendas!B16","v":"Luz tienda Madrid 1"}]
[{"$f":"$A$853&Tiendas!A17","v":"6280020052"},{"$f":"\"Luz tienda\"&\" \"&Tiendas!B17","v":"Luz tienda Madrid 2"}]
[{"$f":"$A$853&Tiendas!A18","v":"6280020053"},{"$f":"\"Luz tienda\"&\" \"&Tiendas!B18","v":"Luz tienda Madrid 3"}]
[{"$f":"$A$853&Tiendas!A19","v":"6280020054"},{"$f":"\"Luz tienda\"&\" \"&Tiendas!B19","v":"Luz tienda Madrid 4"}]
[{"$f":"$A$853&Tiendas!A20","v":"6280020055"},{"$f":"\"Luz tienda\"&\" \"&Tiendas!B20","v":"Luz tienda Madrid 5"}]
[{"$f":"$A$853&Tiendas!A21","v":"6280020061"},{"$f":"\"Luz tienda\"&\" \"&Tiendas!B21","v":"Luz tienda Barcelona 1"}]
[{"$f":"$A$853&Tiendas!A22","v":"6280020062"},{"$f":"\"Luz tienda\"&\" \"&Tiendas!B22","v":"Luz tienda Barcelona 2"}]
[{"$f":"$A$853&Tiendas!A23","v":"6280020063"},{"$f":"\"Luz tienda\"&\" \"&Tiendas!B23","v":"Luz tienda Barcelona 3"}]
[{"$f":"$A$853&Tiendas!A24","v":"6280020064"},{"$f":"\"Luz tienda\"&\" \"&Tiendas!B24","v":"Luz tienda Barcelona 4"}]
[{"$f":"$A$853&Tiendas!A25","v":"6280020071"},{"$f":"\"Luz tienda\"&\" \"&Tiendas!B25","v":"Luz tienda Bilbao 1"}]
[{"$f":"$A$853&Tiendas!A26","v":"6280020072"},{"$f":"\"Luz tienda\"&\" \"&Tiendas!B26","v":"Luz tienda Bilbao 2"}]
[{"$f":"$A$853&Tiendas!A27","v":"6280020080"},{"$f":"\"Luz tienda\"&\" \"&Tiendas!B27","v":"Luz tienda Almacén"}]
[{"$f":"\"62800300\"","v":"62800300"},"Teléfono"]
[{"$f":"$A$880&Tiendas!A2","v":"6280030011"},{"$f":"\"Teléfono tienda\"&\" \"&Tiendas!B2","v":"Teléfono tienda A Coruña 1"}]
[{"$f":"$A$880&Tiendas!A3","v":"6280030012"},{"$f":"\"Teléfono tienda\"&\" \"&Tiendas!B3","v":"Teléfono tienda A Coruña 2"}]
[{"$f":"$A$880&Tiendas!A4","v":"6280030013"},{"$f":"\"Teléfono tienda\"&\" \"&Tiendas!B4","v":"Teléfono tienda A Coruña 3"}]
[{"$f":"$A$880&Tiendas!A5","v":"6280030014"},{"$f":"\"Teléfono tienda\"&\" \"&Tiendas!B5","v":"Teléfono tienda A Coruña 4"}]
[{"$f":"$A$880&Tiendas!A6","v":"6280030015"},{"$f":"\"Teléfono tienda\"&\" \"&Tiendas!B6","v":"Teléfono tienda A Coruña 5"}]
[{"$f":"$A$880&Tiendas!A7","v":"6280030021"},{"$f":"\"Teléfono tienda\"&\" \"&Tiendas!B7","v":"Teléfono tienda Lugo 1"}]
[{"$f":"$A$880&Tiendas!A8","v":"6280030022"},{"$f":"\"Teléfono tienda\"&\" \"&Tiendas!B8","v":"Teléfono tienda Lugo 2"}]
[{"$f":"$A$880&Tiendas!A9","v":"6280030031"},{"$f":"\"Teléfono tienda\"&\" \"&Tiendas!B9","v":"Teléfono tienda Ourense 1"}]
[{"$f":"$A$880&Tiendas!A10","v":"6280030032"},{"$f":"\"Teléfono tienda\"&\" \"&Tiendas!B10","v":"Teléfono tienda Ourense 2"}]
[{"$f":"$A$880&Tiendas!A11","v":"6280030033"},{"$f":"\"Teléfono tienda\"&\" \"&Tiendas!B11","v":"Teléfono tienda Ourense 3"}]
[{"$f":"$A$880&Tiendas!A12","v":"6280030041"},{"$f":"\"Teléfono tienda\"&\" \"&Tiendas!B12","v":"Teléfono tienda Pontevedra 1"}]
[{"$f":"$A$880&Tiendas!A13","v":"6280030042"},{"$f":"\"Teléfono tienda\"&\" \"&Tiendas!B13","v":"Teléfono tienda Pontevedra 2"}]
[{"$f":"$A$880&Tiendas!A14","v":"6280030043"},{"$f":"\"Teléfono tienda\"&\" \"&Tiendas!B14","v":"Teléfono tienda Pontevedra 3"}]
[{"$f":"$A$880&Tiendas!A15","v":"6280030044"},{"$f":"\"Teléfono tienda\"&\" \"&Tiendas!B15","v":"Teléfono tienda Pontevedra 4"}]
[{"$f":"$A$880&Tiendas!A16","v":"6280030051"},{"$f":"\"Teléfono tienda\"&\" \"&Tiendas!B16","v":"Teléfono tienda Madrid 1"}]
[{"$f":"$A$880&Tiendas!A17","v":"6280030052"},{"$f":"\"Teléfono tienda\"&\" \"&Tiendas!B17","v":"Teléfono tienda Madrid 2"}]
[{"$f":"$A$880&Tiendas!A18","v":"6280030053"},{"$f":"\"Teléfono tienda\"&\" \"&Tiendas!B18","v":"Teléfono tienda Madrid 3"}]
[{"$f":"$A$880&Tiendas!A19","v":"6280030054"},{"$f":"\"Teléfono tienda\"&\" \"&Tiendas!B19","v":"Teléfono tienda Madrid 4"}]
[{"$f":"$A$880&Tiendas!A20","v":"6280030055"},{"$f":"\"Teléfono tienda\"&\" \"&Tiendas!B20","v":"Teléfono tienda Madrid 5"}]
[{"$f":"$A$880&Tiendas!A21","v":"6280030061"},{"$f":"\"Teléfono tienda\"&\" \"&Tiendas!B21","v":"Teléfono tienda Barcelona 1"}]
[{"$f":"$A$880&Tiendas!A22","v":"6280030062"},{"$f":"\"Teléfono tienda\"&\" \"&Tiendas!B22","v":"Teléfono tienda Barcelona 2"}]
[{"$f":"$A$880&Tiendas!A23","v":"6280030063"},{"$f":"\"Teléfono tienda\"&\" \"&Tiendas!B23","v":"Teléfono tienda Barcelona 3"}]
[{"$f":"$A$880&Tiendas!A24","v":"6280030064"},{"$f":"\"Teléfono tienda\"&\" \"&Tiendas!B24","v":"Teléfono tienda Barcelona 4"}]
[{"$f":"$A$880&Tiendas!A25","v":"6280030071"},{"$f":"\"Teléfono tienda\"&\" \"&Tiendas!B25","v":"Teléfono tienda Bilbao 1"}]
[{"$f":"$A$880&Tiendas!A26","v":"6280030072"},{"$f":"\"Teléfono tienda\"&\" \"&Tiendas!B26","v":"Teléfono tienda Bilbao 2"}]
[{"$f":"$A$880&Tiendas!A27","v":"6280030080"},{"$f":"\"Teléfono tienda\"&\" \"&Tiendas!B27","v":"Teléfono tienda Almacén"}]
[629,"OTROS SERVICIOS"]
[{"$f":"\"62900000\"&Tiendas!A2","v":"6290000011"},{"$f":"\"Otros servicios tienda\"&\" \"&Tiendas!B2","v":"Otros servicios tienda A Coruña 1"}]
[{"$f":"\"62900000\"&Tiendas!A3","v":"6290000012"},{"$f":"\"Otros servicios tienda\"&\" \"&Tiendas!B3","v":"Otros servicios tienda A Coruña 2"}]
[{"$f":"\"62900000\"&Tiendas!A4","v":"6290000013"},{"$f":"\"Otros servicios tienda\"&\" \"&Tiendas!B4","v":"Otros servicios tienda A Coruña 3"}]
[{"$f":"\"62900000\"&Tiendas!A5","v":"6290000014"},{"$f":"\"Otros servicios tienda\"&\" \"&Tiendas!B5","v":"Otros servicios tienda A Coruña 4"}]
[{"$f":"\"62900000\"&Tiendas!A6","v":"6290000015"},{"$f":"\"Otros servicios tienda\"&\" \"&Tiendas!B6","v":"Otros servicios tienda A Coruña 5"}]
[{"$f":"\"62900000\"&Tiendas!A7","v":"6290000021"},{"$f":"\"Otros servicios tienda\"&\" \"&Tiendas!B7","v":"Otros servicios tienda Lugo 1"}]
[{"$f":"\"62900000\"&Tiendas!A8","v":"6290000022"},{"$f":"\"Otros servicios tienda\"&\" \"&Tiendas!B8","v":"Otros servicios tienda Lugo 2"}]
[{"$f":"\"62900000\"&Tiendas!A9","v":"6290000031"},{"$f":"\"Otros servicios tienda\"&\" \"&Tiendas!B9","v":"Otros servicios tienda Ourense 1"}]
[{"$f":"\"62900000\"&Tiendas!A10","v":"6290000032"},{"$f":"\"Otros servicios tienda\"&\" \"&Tiendas!B10","v":"Otros servicios tienda Ourense 2"}]
[{"$f":"\"62900000\"&Tiendas!A11","v":"6290000033"},{"$f":"\"Otros servicios tienda\"&\" \"&Tiendas!B11","v":"Otros servicios tienda Ourense 3"}]
[{"$f":"\"62900000\"&Tiendas!A12","v":"6290000041"},{"$f":"\"Otros servicios tienda\"&\" \"&Tiendas!B12","v":"Otros servicios tienda Pontevedra 1"}]
[{"$f":"\"62900000\"&Tiendas!A13","v":"6290000042"},{"$f":"\"Otros servicios tienda\"&\" \"&Tiendas!B13","v":"Otros servicios tienda Pontevedra 2"}]
[{"$f":"\"62900000\"&Tiendas!A14","v":"6290000043"},{"$f":"\"Otros servicios tienda\"&\" \"&Tiendas!B14","v":"Otros servicios tienda Pontevedra 3"}]
[{"$f":"\"62900000\"&Tiendas!A15","v":"6290000044"},{"$f":"\"Otros servicios tienda\"&\" \"&Tiendas!B15","v":"Otros servicios tienda Pontevedra 4"}]
[{"$f":"\"62900000\"&Tiendas!A16","v":"6290000051"},{"$f":"\"Otros servicios tienda\"&\" \"&Tiendas!B16","v":"Otros servicios tienda Madrid 1"}]
[{"$f":"\"62900000\"&Tiendas!A17","v":"6290000052"},{"$f":"\"Otros servicios tienda\"&\" \"&Tiendas!B17","v":"Otros servicios tienda Madrid 2"}]
[{"$f":"\"62900000\"&Tiendas!A18","v":"6290000053"},{"$f":"\"Otros servicios tienda\"&\" \"&Tiendas!B18","v":"Otros servicios tienda Madrid 3"}]
[{"$f":"\"62900000\"&Tiendas!A19","v":"6290000054"},{"$f":"\"Otros servicios tienda\"&\" \"&Tiendas!B19","v":"Otros servicios tienda Madrid 4"}]
[{"$f":"\"62900000\"&Tiendas!A20","v":"6290000055"},{"$f":"\"Otros servicios tienda\"&\" \"&Tiendas!B20","v":"Otros servicios tienda Madrid 5"}]
[{"$f":"\"62900000\"&Tiendas!A21","v":"6290000061"},{"$f":"\"Otros servicios tienda\"&\" \"&Tiendas!B21","v":"Otros servicios tienda Barcelona 1"}]
[{"$f":"\"62900000\"&Tiendas!A22","v":"6290000062"},{"$f":"\"Otros servicios tienda\"&\" \"&Tiendas!B22","v":"Otros servicios tienda Barcelona 2"}]
[{"$f":"\"62900000\"&Tiendas!A23","v":"6290000063"},{"$f":"\"Otros servicios tienda\"&\" \"&Tiendas!B23","v":"Otros servicios tienda Barcelona 3"}]
[{"$f":"\"62900000\"&Tiendas!A24","v":"6290000064"},{"$f":"\"Otros servicios tienda\"&\" \"&Tiendas!B24","v":"Otros servicios tienda Barcelona 4"}]
[{"$f":"\"62900000\"&Tiendas!A25","v":"6290000071"},{"$f":"\"Otros servicios tienda\"&\" \"&Tiendas!B25","v":"Otros servicios tienda Bilbao 1"}]
[{"$f":"\"62900000\"&Tiendas!A26","v":"6290000072"},{"$f":"\"Otros servicios tienda\"&\" \"&Tiendas!B26","v":"Otros servicios tienda Bilbao 2"}]
[{"$f":"\"62900000\"&Tiendas!A27","v":"6290000080"},{"$f":"\"Otros servicios tienda\"&\" \"&Tiendas!B27","v":"Otros servicios tienda Almacén"}]
["63.","TRIBUTOS"]
[630,"IMPUESTO SOBRE BENEFICIOS"]
[6300,"IMPUESTO CORRIENTE"]
[{"$f":"63000000&Tiendas!A2","v":"6300000011"},{"$f":"\"Impuesto corriente tienda\"&\" \"&Tiendas!B2","v":"Impuesto corriente tienda A Coruña 1"}]
[{"$f":"63000000&Tiendas!A3","v":"6300000012"},{"$f":"\"Impuesto corriente tienda\"&\" \"&Tiendas!B3","v":"Impuesto corriente tienda A Coruña 2"}]
[{"$f":"63000000&Tiendas!A4","v":"6300000013"},{"$f":"\"Impuesto corriente tienda\"&\" \"&Tiendas!B4","v":"Impuesto corriente tienda A Coruña 3"}]
[{"$f":"63000000&Tiendas!A5","v":"6300000014"},{"$f":"\"Impuesto corriente tienda\"&\" \"&Tiendas!B5","v":"Impuesto corriente tienda A Coruña 4"}]
[{"$f":"63000000&Tiendas!A6","v":"6300000015"},{"$f":"\"Impuesto corriente tienda\"&\" \"&Tiendas!B6","v":"Impuesto corriente tienda A Coruña 5"}]
[{"$f":"63000000&Tiendas!A7","v":"6300000021"},{"$f":"\"Impuesto corriente tienda\"&\" \"&Tiendas!B7","v":"Impuesto corriente tienda Lugo 1"}]
[{"$f":"63000000&Tiendas!A8","v":"6300000022"},{"$f":"\"Impuesto corriente tienda\"&\" \"&Tiendas!B8","v":"Impuesto corriente tienda Lugo 2"}]
[{"$f":"63000000&Tiendas!A9","v":"6300000031"},{"$f":"\"Impuesto corriente tienda\"&\" \"&Tiendas!B9","v":"Impuesto corriente tienda Ourense 1"}]
[{"$f":"63000000&Tiendas!A10","v":"6300000032"},{"$f":"\"Impuesto corriente tienda\"&\" \"&Tiendas!B10","v":"Impuesto corriente tienda Ourense 2"}]
[{"$f":"63000000&Tiendas!A11","v":"6300000033"},{"$f":"\"Impuesto corriente tienda\"&\" \"&Tiendas!B11","v":"Impuesto corriente tienda Ourense 3"}]
[{"$f":"63000000&Tiendas!A12","v":"6300000041"},{"$f":"\"Impuesto corriente tienda\"&\" \"&Tiendas!B12","v":"Impuesto corriente tienda Pontevedra 1"}]
[{"$f":"63000000&Tiendas!A13","v":"6300000042"},{"$f":"\"Impuesto corriente tienda\"&\" \"&Tiendas!B13","v":"Impuesto corriente tienda Pontevedra 2"}]
[{"$f":"63000000&Tiendas!A14","v":"6300000043"},{"$f":"\"Impuesto corriente tienda\"&\" \"&Tiendas!B14","v":"Impuesto corriente tienda Pontevedra 3"}]
[{"$f":"63000000&Tiendas!A15","v":"6300000044"},{"$f":"\"Impuesto corriente tienda\"&\" \"&Tiendas!B15","v":"Impuesto corriente tienda Pontevedra 4"}]
[{"$f":"63000000&Tiendas!A16","v":"6300000051"},{"$f":"\"Impuesto corriente tienda\"&\" \"&Tiendas!B16","v":"Impuesto corriente tienda Madrid 1"}]
[{"$f":"63000000&Tiendas!A17","v":"6300000052"},{"$f":"\"Impuesto corriente tienda\"&\" \"&Tiendas!B17","v":"Impuesto corriente tienda Madrid 2"}]
[{"$f":"63000000&Tiendas!A18","v":"6300000053"},{"$f":"\"Impuesto corriente tienda\"&\" \"&Tiendas!B18","v":"Impuesto corriente tienda Madrid 3"}]
[{"$f":"63000000&Tiendas!A19","v":"6300000054"},{"$f":"\"Impuesto corriente tienda\"&\" \"&Tiendas!B19","v":"Impuesto corriente tienda Madrid 4"}]
[{"$f":"63000000&Tiendas!A20","v":"6300000055"},{"$f":"\"Impuesto corriente tienda\"&\" \"&Tiendas!B20","v":"Impuesto corriente tienda Madrid 5"}]
[{"$f":"63000000&Tiendas!A21","v":"6300000061"},{"$f":"\"Impuesto corriente tienda\"&\" \"&Tiendas!B21","v":"Impuesto corriente tienda Barcelona 1"}]
[{"$f":"63000000&Tiendas!A22","v":"6300000062"},{"$f":"\"Impuesto corriente tienda\"&\" \"&Tiendas!B22","v":"Impuesto corriente tienda Barcelona 2"}]
[{"$f":"63000000&Tiendas!A23","v":"6300000063"},{"$f":"\"Impuesto corriente tienda\"&\" \"&Tiendas!B23","v":"Impuesto corriente tienda Barcelona 3"}]
[{"$f":"63000000&Tiendas!A24","v":"6300000064"},{"$f":"\"Impuesto corriente tienda\"&\" \"&Tiendas!B24","v":"Impuesto corriente tienda Barcelona 4"}]
[{"$f":"63000000&Tiendas!A25","v":"6300000071"},{"$f":"\"Impuesto corriente tienda\"&\" \"&Tiendas!B25","v":"Impuesto corriente tienda Bilbao 1"}]
[{"$f":"63000000&Tiendas!A26","v":"6300000072"},{"$f":"\"Impuesto corriente tienda\"&\" \"&Tiendas!B26","v":"Impuesto corriente tienda Bilbao 2"}]
[{"$f":"63000000&Tiendas!A27","v":"6300000080"},{"$f":"\"Impuesto corriente tienda\"&\" \"&Tiendas!B27","v":"Impuesto corriente tienda Almacén"}]
[6301,"IMPUESTO DIFERIDO"]
[{"$f":"\"63010000\"&Tiendas!A2","v":"6301000011"},{"$f":"\"Impuesto diferido tienda\"&\" \"&Tiendas!B2","v":"Impuesto diferido tienda A Coruña 1"}]
[{"$f":"\"63010000\"&Tiendas!A3","v":"6301000012"},{"$f":"\"Impuesto diferido tienda\"&\" \"&Tiendas!B3","v":"Impuesto diferido tienda A Coruña 2"}]
[{"$f":"\"63010000\"&Tiendas!A4","v":"6301000013"},{"$f":"\"Impuesto diferido tienda\"&\" \"&Tiendas!B4","v":"Impuesto diferido tienda A Coruña 3"}]
[{"$f":"\"63010000\"&Tiendas!A5","v":"6301000014"},{"$f":"\"Impuesto diferido tienda\"&\" \"&Tiendas!B5","v":"Impuesto diferido tienda A Coruña 4"}]
[{"$f":"\"63010000\"&Tiendas!A6","v":"6301000015"},{"$f":"\"Impuesto diferido tienda\"&\" \"&Tiendas!B6","v":"Impuesto diferido tienda A Coruña 5"}]
[{"$f":"\"63010000\"&Tiendas!A7","v":"6301000021"},{"$f":"\"Impuesto diferido tienda\"&\" \"&Tiendas!B7","v":"Impuesto diferido tienda Lugo 1"}]
[{"$f":"\"63010000\"&Tiendas!A8","v":"6301000022"},{"$f":"\"Impuesto diferido tienda\"&\" \"&Tiendas!B8","v":"Impuesto diferido tienda Lugo 2"}]
[{"$f":"\"63010000\"&Tiendas!A9","v":"6301000031"},{"$f":"\"Impuesto diferido tienda\"&\" \"&Tiendas!B9","v":"Impuesto diferido tienda Ourense 1"}]
[{"$f":"\"63010000\"&Tiendas!A10","v":"6301000032"},{"$f":"\"Impuesto diferido tienda\"&\" \"&Tiendas!B10","v":"Impuesto diferido tienda Ourense 2"}]
[{"$f":"\"63010000\"&Tiendas!A11","v":"6301000033"},{"$f":"\"Impuesto diferido tienda\"&\" \"&Tiendas!B11","v":"Impuesto diferido tienda Ourense 3"}]
[{"$f":"\"63010000\"&Tiendas!A12","v":"6301000041"},{"$f":"\"Impuesto diferido tienda\"&\" \"&Tiendas!B12","v":"Impuesto diferido tienda Pontevedra 1"}]
[{"$f":"\"63010000\"&Tiendas!A13","v":"6301000042"},{"$f":"\"Impuesto diferido tienda\"&\" \"&Tiendas!B13","v":"Impuesto diferido tienda Pontevedra 2"}]
[{"$f":"\"63010000\"&Tiendas!A14","v":"6301000043"},{"$f":"\"Impuesto diferido tienda\"&\" \"&Tiendas!B14","v":"Impuesto diferido tienda Pontevedra 3"}]
[{"$f":"\"63010000\"&Tiendas!A15","v":"6301000044"},{"$f":"\"Impuesto diferido tienda\"&\" \"&Tiendas!B15","v":"Impuesto diferido tienda Pontevedra 4"}]
[{"$f":"\"63010000\"&Tiendas!A16","v":"6301000051"},{"$f":"\"Impuesto diferido tienda\"&\" \"&Tiendas!B16","v":"Impuesto diferido tienda Madrid 1"}]
[{"$f":"\"63010000\"&Tiendas!A17","v":"6301000052"},{"$f":"\"Impuesto diferido tienda\"&\" \"&Tiendas!B17","v":"Impuesto diferido tienda Madrid 2"}]
[{"$f":"\"63010000\"&Tiendas!A18","v":"6301000053"},{"$f":"\"Impuesto diferido tienda\"&\" \"&Tiendas!B18","v":"Impuesto diferido tienda Madrid 3"}]
[{"$f":"\"63010000\"&Tiendas!A19","v":"6301000054"},{"$f":"\"Impuesto diferido tienda\"&\" \"&Tiendas!B19","v":"Impuesto diferido tienda Madrid 4"}]
[{"$f":"\"63010000\"&Tiendas!A20","v":"6301000055"},{"$f":"\"Impuesto diferido tienda\"&\" \"&Tiendas!B20","v":"Impuesto diferido tienda Madrid 5"}]
[{"$f":"\"63010000\"&Tiendas!A21","v":"6301000061"},{"$f":"\"Impuesto diferido tienda\"&\" \"&Tiendas!B21","v":"Impuesto diferido tienda Barcelona 1"}]
[{"$f":"\"63010000\"&Tiendas!A22","v":"6301000062"},{"$f":"\"Impuesto diferido tienda\"&\" \"&Tiendas!B22","v":"Impuesto diferido tienda Barcelona 2"}]
[{"$f":"\"63010000\"&Tiendas!A23","v":"6301000063"},{"$f":"\"Impuesto diferido tienda\"&\" \"&Tiendas!B23","v":"Impuesto diferido tienda Barcelona 3"}]
[{"$f":"\"63010000\"&Tiendas!A24","v":"6301000064"},{"$f":"\"Impuesto diferido tienda\"&\" \"&Tiendas!B24","v":"Impuesto diferido tienda Barcelona 4"}]
[{"$f":"\"63010000\"&Tiendas!A25","v":"6301000071"},{"$f":"\"Impuesto diferido tienda\"&\" \"&Tiendas!B25","v":"Impuesto diferido tienda Bilbao 1"}]
[{"$f":"\"63010000\"&Tiendas!A26","v":"6301000072"},{"$f":"\"Impuesto diferido tienda\"&\" \"&Tiendas!B26","v":"Impuesto diferido tienda Bilbao 2"}]
[{"$f":"\"63010000\"&Tiendas!A27","v":"6301000080"},{"$f":"\"Impuesto diferido tienda\"&\" \"&Tiendas!B27","v":"Impuesto diferido tienda Almacén"}]
[631,"OTROS TRIBUTOS"]
[{"$f":"\"63100000\"&Tiendas!A2","v":"6310000011"},{"$f":"\"Otros tributos tienda\"&\" \"&Tiendas!B2","v":"Otros tributos tienda A Coruña 1"}]
[{"$f":"\"63100000\"&Tiendas!A3","v":"6310000012"},{"$f":"\"Otros tributos tienda\"&\" \"&Tiendas!B3","v":"Otros tributos tienda A Coruña 2"}]
[{"$f":"\"63100000\"&Tiendas!A4","v":"6310000013"},{"$f":"\"Otros tributos tienda\"&\" \"&Tiendas!B4","v":"Otros tributos tienda A Coruña 3"}]
[{"$f":"\"63100000\"&Tiendas!A5","v":"6310000014"},{"$f":"\"Otros tributos tienda\"&\" \"&Tiendas!B5","v":"Otros tributos tienda A Coruña 4"}]
[{"$f":"\"63100000\"&Tiendas!A6","v":"6310000015"},{"$f":"\"Otros tributos tienda\"&\" \"&Tiendas!B6","v":"Otros tributos tienda A Coruña 5"}]
[{"$f":"\"63100000\"&Tiendas!A7","v":"6310000021"},{"$f":"\"Otros tributos tienda\"&\" \"&Tiendas!B7","v":"Otros tributos tienda Lugo 1"}]
[{"$f":"\"63100000\"&Tiendas!A8","v":"6310000022"},{"$f":"\"Otros tributos tienda\"&\" \"&Tiendas!B8","v":"Otros tributos tienda Lugo 2"}]
[{"$f":"\"63100000\"&Tiendas!A9","v":"6310000031"},{"$f":"\"Otros tributos tienda\"&\" \"&Tiendas!B9","v":"Otros tributos tienda Ourense 1"}]
[{"$f":"\"63100000\"&Tiendas!A10","v":"6310000032"},{"$f":"\"Otros tributos tienda\"&\" \"&Tiendas!B10","v":"Otros tributos tienda Ourense 2"}]
[{"$f":"\"63100000\"&Tiendas!A11","v":"6310000033"},{"$f":"\"Otros tributos tienda\"&\" \"&Tiendas!B11","v":"Otros tributos tienda Ourense 3"}]
[{"$f":"\"63100000\"&Tiendas!A12","v":"6310000041"},{"$f":"\"Otros tributos tienda\"&\" \"&Tiendas!B12","v":"Otros tributos tienda Pontevedra 1"}]
[{"$f":"\"63100000\"&Tiendas!A13","v":"6310000042"},{"$f":"\"Otros tributos tienda\"&\" \"&Tiendas!B13","v":"Otros tributos tienda Pontevedra 2"}]
[{"$f":"\"63100000\"&Tiendas!A14","v":"6310000043"},{"$f":"\"Otros tributos tienda\"&\" \"&Tiendas!B14","v":"Otros tributos tienda Pontevedra 3"}]
[{"$f":"\"63100000\"&Tiendas!A15","v":"6310000044"},{"$f":"\"Otros tributos tienda\"&\" \"&Tiendas!B15","v":"Otros tributos tienda Pontevedra 4"}]
[{"$f":"\"63100000\"&Tiendas!A16","v":"6310000051"},{"$f":"\"Otros tributos tienda\"&\" \"&Tiendas!B16","v":"Otros tributos tienda Madrid 1"}]
[{"$f":"\"63100000\"&Tiendas!A17","v":"6310000052"},{"$f":"\"Otros tributos tienda\"&\" \"&Tiendas!B17","v":"Otros tributos tienda Madrid 2"}]
[{"$f":"\"63100000\"&Tiendas!A18","v":"6310000053"},{"$f":"\"Otros tributos tienda\"&\" \"&Tiendas!B18","v":"Otros tributos tienda Madrid 3"}]
[{"$f":"\"63100000\"&Tiendas!A19","v":"6310000054"},{"$f":"\"Otros tributos tienda\"&\" \"&Tiendas!B19","v":"Otros tributos tienda Madrid 4"}]
[{"$f":"\"63100000\"&Tiendas!A20","v":"6310000055"},{"$f":"\"Otros tributos tienda\"&\" \"&Tiendas!B20","v":"Otros tributos tienda Madrid 5"}]
[{"$f":"\"63100000\"&Tiendas!A21","v":"6310000061"},{"$f":"\"Otros tributos tienda\"&\" \"&Tiendas!B21","v":"Otros tributos tienda Barcelona 1"}]
[{"$f":"\"63100000\"&Tiendas!A22","v":"6310000062"},{"$f":"\"Otros tributos tienda\"&\" \"&Tiendas!B22","v":"Otros tributos tienda Barcelona 2"}]
[{"$f":"\"63100000\"&Tiendas!A23","v":"6310000063"},{"$f":"\"Otros tributos tienda\"&\" \"&Tiendas!B23","v":"Otros tributos tienda Barcelona 3"}]
[{"$f":"\"63100000\"&Tiendas!A24","v":"6310000064"},{"$f":"\"Otros tributos tienda\"&\" \"&Tiendas!B24","v":"Otros tributos tienda Barcelona 4"}]
[{"$f":"\"63100000\"&Tiendas!A25","v":"6310000071"},{"$f":"\"Otros tributos tienda\"&\" \"&Tiendas!B25","v":"Otros tributos tienda Bilbao 1"}]
[{"$f":"\"63100000\"&Tiendas!A26","v":"6310000072"},{"$f":"\"Otros tributos tienda\"&\" \"&Tiendas!B26","v":"Otros tributos tienda Bilbao 2"}]
[{"$f":"\"63100000\"&Tiendas!A27","v":"6310000080"},{"$f":"\"Otros tributos tienda\"&\" \"&Tiendas!B27","v":"Otros tributos tienda Almacén"}]
[633,"AJUSTES NEGATIVOS EN LA IMPOSICIÓN SOBRE BENEFICIOS"]
[634,"AJUSTES NEGATIVOS EN LA IMPOSICIÓN INDIRECTA"]
[6341,"AJUSTES NEGATIVOS EN IVA DE ACTIVO CORRIENTE"]
[6342,"AJUSTES NEGATIVOS EN IVA DE INVERSIONES"]
[636,"DEVOLUCIÓN DE IMPUESTOS"]
[638,"AJUSTES POSITIVOS EN LA IMPOSICIÓN SOBRE BENEFICIOS"]
[639,"AJUSTES POSITIVOS EN LA IMPOSICIÓN INDIRECTA"]
[6391,"AJUSTES POSITIVOS EN IVA DE ACTIVO CORRIENTE"]
[6392,"AJUSTES POSITIVOS EN IVA DE INVERSIONES"]
["64.","GASTOS DE PERSONAL"]
[640,"SUELDOS Y SALARIOS"]
[{"$f":"\"64000000\"&Tiendas!A2","v":"6400000011"},{"$f":"\"Sueldos y salarios tienda\"&\" \"&Tiendas!B2","v":"Sueldos y salarios tienda A Coruña 1"}]
[{"$f":"\"64000000\"&Tiendas!A3","v":"6400000012"},{"$f":"\"Sueldos y salarios tienda\"&\" \"&Tiendas!B3","v":"Sueldos y salarios tienda A Coruña 2"}]
[{"$f":"\"64000000\"&Tiendas!A4","v":"6400000013"},{"$f":"\"Sueldos y salarios tienda\"&\" \"&Tiendas!B4","v":"Sueldos y salarios tienda A Coruña 3"}]
[{"$f":"\"64000000\"&Tiendas!A5","v":"6400000014"},{"$f":"\"Sueldos y salarios tienda\"&\" \"&Tiendas!B5","v":"Sueldos y salarios tienda A Coruña 4"}]
[{"$f":"\"64000000\"&Tiendas!A6","v":"6400000015"},{"$f":"\"Sueldos y salarios tienda\"&\" \"&Tiendas!B6","v":"Sueldos y salarios tienda A Coruña 5"}]
[{"$f":"\"64000000\"&Tiendas!A7","v":"6400000021"},{"$f":"\"Sueldos y salarios tienda\"&\" \"&Tiendas!B7","v":"Sueldos y salarios tienda Lugo 1"}]
[{"$f":"\"64000000\"&Tiendas!A8","v":"6400000022"},{"$f":"\"Sueldos y salarios tienda\"&\" \"&Tiendas!B8","v":"Sueldos y salarios tienda Lugo 2"}]
[{"$f":"\"64000000\"&Tiendas!A9","v":"6400000031"},{"$f":"\"Sueldos y salarios tienda\"&\" \"&Tiendas!B9","v":"Sueldos y salarios tienda Ourense 1"}]
[{"$f":"\"64000000\"&Tiendas!A10","v":"6400000032"},{"$f":"\"Sueldos y salarios tienda\"&\" \"&Tiendas!B10","v":"Sueldos y salarios tienda Ourense 2"}]
[{"$f":"\"64000000\"&Tiendas!A11","v":"6400000033"},{"$f":"\"Sueldos y salarios tienda\"&\" \"&Tiendas!B11","v":"Sueldos y salarios tienda Ourense 3"}]
[{"$f":"\"64000000\"&Tiendas!A12","v":"6400000041"},{"$f":"\"Sueldos y salarios tienda\"&\" \"&Tiendas!B12","v":"Sueldos y salarios tienda Pontevedra 1"}]
[{"$f":"\"64000000\"&Tiendas!A13","v":"6400000042"},{"$f":"\"Sueldos y salarios tienda\"&\" \"&Tiendas!B13","v":"Sueldos y salarios tienda Pontevedra 2"}]
[{"$f":"\"64000000\"&Tiendas!A14","v":"6400000043"},{"$f":"\"Sueldos y salarios tienda\"&\" \"&Tiendas!B14","v":"Sueldos y salarios tienda Pontevedra 3"}]
[{"$f":"\"64000000\"&Tiendas!A15","v":"6400000044"},{"$f":"\"Sueldos y salarios tienda\"&\" \"&Tiendas!B15","v":"Sueldos y salarios tienda Pontevedra 4"}]
[{"$f":"\"64000000\"&Tiendas!A16","v":"6400000051"},{"$f":"\"Sueldos y salarios tienda\"&\" \"&Tiendas!B16","v":"Sueldos y salarios tienda Madrid 1"}]
[{"$f":"\"64000000\"&Tiendas!A17","v":"6400000052"},{"$f":"\"Sueldos y salarios tienda\"&\" \"&Tiendas!B17","v":"Sueldos y salarios tienda Madrid 2"}]
[{"$f":"\"64000000\"&Tiendas!A18","v":"6400000053"},{"$f":"\"Sueldos y salarios tienda\"&\" \"&Tiendas!B18","v":"Sueldos y salarios tienda Madrid 3"}]
[{"$f":"\"64000000\"&Tiendas!A19","v":"6400000054"},{"$f":"\"Sueldos y salarios tienda\"&\" \"&Tiendas!B19","v":"Sueldos y salarios tienda Madrid 4"}]
[{"$f":"\"64000000\"&Tiendas!A20","v":"6400000055"},{"$f":"\"Sueldos y salarios tienda\"&\" \"&Tiendas!B20","v":"Sueldos y salarios tienda Madrid 5"}]
[{"$f":"\"64000000\"&Tiendas!A21","v":"6400000061"},{"$f":"\"Sueldos y salarios tienda\"&\" \"&Tiendas!B21","v":"Sueldos y salarios tienda Barcelona 1"}]
[{"$f":"\"64000000\"&Tiendas!A22","v":"6400000062"},{"$f":"\"Sueldos y salarios tienda\"&\" \"&Tiendas!B22","v":"Sueldos y salarios tienda Barcelona 2"}]
[{"$f":"\"64000000\"&Tiendas!A23","v":"6400000063"},{"$f":"\"Sueldos y salarios tienda\"&\" \"&Tiendas!B23","v":"Sueldos y salarios tienda Barcelona 3"}]
[{"$f":"\"64000000\"&Tiendas!A24","v":"6400000064"},{"$f":"\"Sueldos y salarios tienda\"&\" \"&Tiendas!B24","v":"Sueldos y salarios tienda Barcelona 4"}]
[{"$f":"\"64000000\"&Tiendas!A25","v":"6400000071"},{"$f":"\"Sueldos y salarios tienda\"&\" \"&Tiendas!B25","v":"Sueldos y salarios tienda Bilbao 1"}]
[{"$f":"\"64000000\"&Tiendas!A26","v":"6400000072"},{"$f":"\"Sueldos y salarios tienda\"&\" \"&Tiendas!B26","v":"Sueldos y salarios tienda Bilbao 2"}]
[{"$f":"\"64000000\"&Tiendas!A27","v":"6400000080"},{"$f":"\"Sueldos y salarios tienda\"&\" \"&Tiendas!B27","v":"Sueldos y salarios tienda Almacén"}]
[641,"INDEMNIZACIONES"]
[{"$f":"\"64100000\"&Tiendas!A2","v":"6410000011"},{"$f":"\"Indemnizaciones tienda\"&\" \"&Tiendas!B2","v":"Indemnizaciones tienda A Coruña 1"}]
[{"$f":"\"64100000\"&Tiendas!A3","v":"6410000012"},{"$f":"\"Indemnizaciones tienda\"&\" \"&Tiendas!B3","v":"Indemnizaciones tienda A Coruña 2"}]
[{"$f":"\"64100000\"&Tiendas!A4","v":"6410000013"},{"$f":"\"Indemnizaciones tienda\"&\" \"&Tiendas!B4","v":"Indemnizaciones tienda A Coruña 3"}]
[{"$f":"\"64100000\"&Tiendas!A5","v":"6410000014"},{"$f":"\"Indemnizaciones tienda\"&\" \"&Tiendas!B5","v":"Indemnizaciones tienda A Coruña 4"}]
[{"$f":"\"64100000\"&Tiendas!A6","v":"6410000015"},{"$f":"\"Indemnizaciones tienda\"&\" \"&Tiendas!B6","v":"Indemnizaciones tienda A Coruña 5"}]
[{"$f":"\"64100000\"&Tiendas!A7","v":"6410000021"},{"$f":"\"Indemnizaciones tienda\"&\" \"&Tiendas!B7","v":"Indemnizaciones tienda Lugo 1"}]
[{"$f":"\"64100000\"&Tiendas!A8","v":"6410000022"},{"$f":"\"Indemnizaciones tienda\"&\" \"&Tiendas!B8","v":"Indemnizaciones tienda Lugo 2"}]
[{"$f":"\"64100000\"&Tiendas!A9","v":"6410000031"},{"$f":"\"Indemnizaciones tienda\"&\" \"&Tiendas!B9","v":"Indemnizaciones tienda Ourense 1"}]
[{"$f":"\"64100000\"&Tiendas!A10","v":"6410000032"},{"$f":"\"Indemnizaciones tienda\"&\" \"&Tiendas!B10","v":"Indemnizaciones tienda Ourense 2"}]
[{"$f":"\"64100000\"&Tiendas!A11","v":"6410000033"},{"$f":"\"Indemnizaciones tienda\"&\" \"&Tiendas!B11","v":"Indemnizaciones tienda Ourense 3"}]
[{"$f":"\"64100000\"&Tiendas!A12","v":"6410000041"},{"$f":"\"Indemnizaciones tienda\"&\" \"&Tiendas!B12","v":"Indemnizaciones tienda Pontevedra 1"}]
[{"$f":"\"64100000\"&Tiendas!A13","v":"6410000042"},{"$f":"\"Indemnizaciones tienda\"&\" \"&Tiendas!B13","v":"Indemnizaciones tienda Pontevedra 2"}]
[{"$f":"\"64100000\"&Tiendas!A14","v":"6410000043"},{"$f":"\"Indemnizaciones tienda\"&\" \"&Tiendas!B14","v":"Indemnizaciones tienda Pontevedra 3"}]
[{"$f":"\"64100000\"&Tiendas!A15","v":"6410000044"},{"$f":"\"Indemnizaciones tienda\"&\" \"&Tiendas!B15","v":"Indemnizaciones tienda Pontevedra 4"}]
[{"$f":"\"64100000\"&Tiendas!A16","v":"6410000051"},{"$f":"\"Indemnizaciones tienda\"&\" \"&Tiendas!B16","v":"Indemnizaciones tienda Madrid 1"}]
[{"$f":"\"64100000\"&Tiendas!A17","v":"6410000052"},{"$f":"\"Indemnizaciones tienda\"&\" \"&Tiendas!B17","v":"Indemnizaciones tienda Madrid 2"}]
[{"$f":"\"64100000\"&Tiendas!A18","v":"6410000053"},{"$f":"\"Indemnizaciones tienda\"&\" \"&Tiendas!B18","v":"Indemnizaciones tienda Madrid 3"}]
[{"$f":"\"64100000\"&Tiendas!A19","v":"6410000054"},{"$f":"\"Indemnizaciones tienda\"&\" \"&Tiendas!B19","v":"Indemnizaciones tienda Madrid 4"}]
[{"$f":"\"64100000\"&Tiendas!A20","v":"6410000055"},{"$f":"\"Indemnizaciones tienda\"&\" \"&Tiendas!B20","v":"Indemnizaciones tienda Madrid 5"}]
[{"$f":"\"64100000\"&Tiendas!A21","v":"6410000061"},{"$f":"\"Indemnizaciones tienda\"&\" \"&Tiendas!B21","v":"Indemnizaciones tienda Barcelona 1"}]
[{"$f":"\"64100000\"&Tiendas!A22","v":"6410000062"},{"$f":"\"Indemnizaciones tienda\"&\" \"&Tiendas!B22","v":"Indemnizaciones tienda Barcelona 2"}]
[{"$f":"\"64100000\"&Tiendas!A23","v":"6410000063"},{"$f":"\"Indemnizaciones tienda\"&\" \"&Tiendas!B23","v":"Indemnizaciones tienda Barcelona 3"}]
[{"$f":"\"64100000\"&Tiendas!A24","v":"6410000064"},{"$f":"\"Indemnizaciones tienda\"&\" \"&Tiendas!B24","v":"Indemnizaciones tienda Barcelona 4"}]
[{"$f":"\"64100000\"&Tiendas!A25","v":"6410000071"},{"$f":"\"Indemnizaciones tienda\"&\" \"&Tiendas!B25","v":"Indemnizaciones tienda Bilbao 1"}]
[{"$f":"\"64100000\"&Tiendas!A26","v":"6410000072"},{"$f":"\"Indemnizaciones tienda\"&\" \"&Tiendas!B26","v":"Indemnizaciones tienda Bilbao 2"}]
[{"$f":"\"64100000\"&Tiendas!A27","v":"6410000080"},{"$f":"\"Indemnizaciones tienda\"&\" \"&Tiendas!B27","v":"Indemnizaciones tienda Almacén"}]
[642,"SEGURIDAD SOCIAL A CARGO DE LA EMPRESA"]
[{"$f":"\"64200000\"&Tiendas!A2","v":"6420000011"},{"$f":"\"Seguridad social a cargo de la empresa tienda\"&\" \"&Tiendas!B2","v":"Seguridad social a cargo de la empresa tienda A Coruña 1"}]
[{"$f":"\"64200000\"&Tiendas!A3","v":"6420000012"},{"$f":"\"Seguridad social a cargo de la empresa tienda\"&\" \"&Tiendas!B3","v":"Seguridad social a cargo de la empresa tienda A Coruña 2"}]
[{"$f":"\"64200000\"&Tiendas!A4","v":"6420000013"},{"$f":"\"Seguridad social a cargo de la empresa tienda\"&\" \"&Tiendas!B4","v":"Seguridad social a cargo de la empresa tienda A Coruña 3"}]
[{"$f":"\"64200000\"&Tiendas!A5","v":"6420000014"},{"$f":"\"Seguridad social a cargo de la empresa tienda\"&\" \"&Tiendas!B5","v":"Seguridad social a cargo de la empresa tienda A Coruña 4"}]
[{"$f":"\"64200000\"&Tiendas!A6","v":"6420000015"},{"$f":"\"Seguridad social a cargo de la empresa tienda\"&\" \"&Tiendas!B6","v":"Seguridad social a cargo de la empresa tienda A Coruña 5"}]
[{"$f":"\"64200000\"&Tiendas!A7","v":"6420000021"},{"$f":"\"Seguridad social a cargo de la empresa tienda\"&\" \"&Tiendas!B7","v":"Seguridad social a cargo de la empresa tienda Lugo 1"}]
[{"$f":"\"64200000\"&Tiendas!A8","v":"6420000022"},{"$f":"\"Seguridad social a cargo de la empresa tienda\"&\" \"&Tiendas!B8","v":"Seguridad social a cargo de la empresa tienda Lugo 2"}]
[{"$f":"\"64200000\"&Tiendas!A9","v":"6420000031"},{"$f":"\"Seguridad social a cargo de la empresa tienda\"&\" \"&Tiendas!B9","v":"Seguridad social a cargo de la empresa tienda Ourense 1"}]
[{"$f":"\"64200000\"&Tiendas!A10","v":"6420000032"},{"$f":"\"Seguridad social a cargo de la empresa tienda\"&\" \"&Tiendas!B10","v":"Seguridad social a cargo de la empresa tienda Ourense 2"}]
[{"$f":"\"64200000\"&Tiendas!A11","v":"6420000033"},{"$f":"\"Seguridad social a cargo de la empresa tienda\"&\" \"&Tiendas!B11","v":"Seguridad social a cargo de la empresa tienda Ourense 3"}]
[{"$f":"\"64200000\"&Tiendas!A12","v":"6420000041"},{"$f":"\"Seguridad social a cargo de la empresa tienda\"&\" \"&Tiendas!B12","v":"Seguridad social a cargo de la empresa tienda Pontevedra 1"}]
[{"$f":"\"64200000\"&Tiendas!A13","v":"6420000042"},{"$f":"\"Seguridad social a cargo de la empresa tienda\"&\" \"&Tiendas!B13","v":"Seguridad social a cargo de la empresa tienda Pontevedra 2"}]
[{"$f":"\"64200000\"&Tiendas!A14","v":"6420000043"},{"$f":"\"Seguridad social a cargo de la empresa tienda\"&\" \"&Tiendas!B14","v":"Seguridad social a cargo de la empresa tienda Pontevedra 3"}]
[{"$f":"\"64200000\"&Tiendas!A15","v":"6420000044"},{"$f":"\"Seguridad social a cargo de la empresa tienda\"&\" \"&Tiendas!B15","v":"Seguridad social a cargo de la empresa tienda Pontevedra 4"}]
[{"$f":"\"64200000\"&Tiendas!A16","v":"6420000051"},{"$f":"\"Seguridad social a cargo de la empresa tienda\"&\" \"&Tiendas!B16","v":"Seguridad social a cargo de la empresa tienda Madrid 1"}]
[{"$f":"\"64200000\"&Tiendas!A17","v":"6420000052"},{"$f":"\"Seguridad social a cargo de la empresa tienda\"&\" \"&Tiendas!B17","v":"Seguridad social a cargo de la empresa tienda Madrid 2"}]
[{"$f":"\"64200000\"&Tiendas!A18","v":"6420000053"},{"$f":"\"Seguridad social a cargo de la empresa tienda\"&\" \"&Tiendas!B18","v":"Seguridad social a cargo de la empresa tienda Madrid 3"}]
[{"$f":"\"64200000\"&Tiendas!A19","v":"6420000054"},{"$f":"\"Seguridad social a cargo de la empresa tienda\"&\" \"&Tiendas!B19","v":"Seguridad social a cargo de la empresa tienda Madrid 4"}]
[{"$f":"\"64200000\"&Tiendas!A20","v":"6420000055"},{"$f":"\"Seguridad social a cargo de la empresa tienda\"&\" \"&Tiendas!B20","v":"Seguridad social a cargo de la empresa tienda Madrid 5"}]
[{"$f":"\"64200000\"&Tiendas!A21","v":"6420000061"},{"$f":"\"Seguridad social a cargo de la empresa tienda\"&\" \"&Tiendas!B21","v":"Seguridad social a cargo de la empresa tienda Barcelona 1"}]
[{"$f":"\"64200000\"&Tiendas!A22","v":"6420000062"},{"$f":"\"Seguridad social a cargo de la empresa tienda\"&\" \"&Tiendas!B22","v":"Seguridad social a cargo de la empresa tienda Barcelona 2"}]
[{"$f":"\"64200000\"&Tiendas!A23","v":"6420000063"},{"$f":"\"Seguridad social a cargo de la empresa tienda\"&\" \"&Tiendas!B23","v":"Seguridad social a cargo de la empresa tienda Barcelona 3"}]
[{"$f":"\"64200000\"&Tiendas!A24","v":"6420000064"},{"$f":"\"Seguridad social a cargo de la empresa tienda\"&\" \"&Tiendas!B24","v":"Seguridad social a cargo de la empresa tienda Barcelona 4"}]
[{"$f":"\"64200000\"&Tiendas!A25","v":"6420000071"},{"$f":"\"Seguridad social a cargo de la empresa tienda\"&\" \"&Tiendas!B25","v":"Seguridad social a cargo de la empresa tienda Bilbao 1"}]
[{"$f":"\"64200000\"&Tiendas!A26","v":"6420000072"},{"$f":"\"Seguridad social a cargo de la empresa tienda\"&\" \"&Tiendas!B26","v":"Seguridad social a cargo de la empresa tienda Bilbao 2"}]
[{"$f":"\"64200000\"&Tiendas!A27","v":"6420000080"},{"$f":"\"Seguridad social a cargo de la empresa tienda\"&\" \"&Tiendas!B27","v":"Seguridad social a cargo de la empresa tienda Almacén"}]
[649,"OTROS GASTOS SOCIALES"]
[{"$f":"\"64900000\"&Tiendas!A2","v":"6490000011"},{"$f":"\"Otros gastos sociales tienda\"&\" \"&Tiendas!B2","v":"Otros gastos sociales tienda A Coruña 1"}]
[{"$f":"\"64900000\"&Tiendas!A3","v":"6490000012"},{"$f":"\"Otros gastos sociales tienda\"&\" \"&Tiendas!B3","v":"Otros gastos sociales tienda A Coruña 2"}]
[{"$f":"\"64900000\"&Tiendas!A4","v":"6490000013"},{"$f":"\"Otros gastos sociales tienda\"&\" \"&Tiendas!B4","v":"Otros gastos sociales tienda A Coruña 3"}]
[{"$f":"\"64900000\"&Tiendas!A5","v":"6490000014"},{"$f":"\"Otros gastos sociales tienda\"&\" \"&Tiendas!B5","v":"Otros gastos sociales tienda A Coruña 4"}]
[{"$f":"\"64900000\"&Tiendas!A6","v":"6490000015"},{"$f":"\"Otros gastos sociales tienda\"&\" \"&Tiendas!B6","v":"Otros gastos sociales tienda A Coruña 5"}]
[{"$f":"\"64900000\"&Tiendas!A7","v":"6490000021"},{"$f":"\"Otros gastos sociales tienda\"&\" \"&Tiendas!B7","v":"Otros gastos sociales tienda Lugo 1"}]
[{"$f":"\"64900000\"&Tiendas!A8","v":"6490000022"},{"$f":"\"Otros gastos sociales tienda\"&\" \"&Tiendas!B8","v":"Otros gastos sociales tienda Lugo 2"}]
[{"$f":"\"64900000\"&Tiendas!A9","v":"6490000031"},{"$f":"\"Otros gastos sociales tienda\"&\" \"&Tiendas!B9","v":"Otros gastos sociales tienda Ourense 1"}]
[{"$f":"\"64900000\"&Tiendas!A10","v":"6490000032"},{"$f":"\"Otros gastos sociales tienda\"&\" \"&Tiendas!B10","v":"Otros gastos sociales tienda Ourense 2"}]
[{"$f":"\"64900000\"&Tiendas!A11","v":"6490000033"},{"$f":"\"Otros gastos sociales tienda\"&\" \"&Tiendas!B11","v":"Otros gastos sociales tienda Ourense 3"}]
[{"$f":"\"64900000\"&Tiendas!A12","v":"6490000041"},{"$f":"\"Otros gastos sociales tienda\"&\" \"&Tiendas!B12","v":"Otros gastos sociales tienda Pontevedra 1"}]
[{"$f":"\"64900000\"&Tiendas!A13","v":"6490000042"},{"$f":"\"Otros gastos sociales tienda\"&\" \"&Tiendas!B13","v":"Otros gastos sociales tienda Pontevedra 2"}]
[{"$f":"\"64900000\"&Tiendas!A14","v":"6490000043"},{"$f":"\"Otros gastos sociales tienda\"&\" \"&Tiendas!B14","v":"Otros gastos sociales tienda Pontevedra 3"}]
[{"$f":"\"64900000\"&Tiendas!A15","v":"6490000044"},{"$f":"\"Otros gastos sociales tienda\"&\" \"&Tiendas!B15","v":"Otros gastos sociales tienda Pontevedra 4"}]
[{"$f":"\"64900000\"&Tiendas!A16","v":"6490000051"},{"$f":"\"Otros gastos sociales tienda\"&\" \"&Tiendas!B16","v":"Otros gastos sociales tienda Madrid 1"}]
[{"$f":"\"64900000\"&Tiendas!A17","v":"6490000052"},{"$f":"\"Otros gastos sociales tienda\"&\" \"&Tiendas!B17","v":"Otros gastos sociales tienda Madrid 2"}]
[{"$f":"\"64900000\"&Tiendas!A18","v":"6490000053"},{"$f":"\"Otros gastos sociales tienda\"&\" \"&Tiendas!B18","v":"Otros gastos sociales tienda Madrid 3"}]
[{"$f":"\"64900000\"&Tiendas!A19","v":"6490000054"},{"$f":"\"Otros gastos sociales tienda\"&\" \"&Tiendas!B19","v":"Otros gastos sociales tienda Madrid 4"}]
[{"$f":"\"64900000\"&Tiendas!A20","v":"6490000055"},{"$f":"\"Otros gastos sociales tienda\"&\" \"&Tiendas!B20","v":"Otros gastos sociales tienda Madrid 5"}]
[{"$f":"\"64900000\"&Tiendas!A21","v":"6490000061"},{"$f":"\"Otros gastos sociales tienda\"&\" \"&Tiendas!B21","v":"Otros gastos sociales tienda Barcelona 1"}]
[{"$f":"\"64900000\"&Tiendas!A22","v":"6490000062"},{"$f":"\"Otros gastos sociales tienda\"&\" \"&Tiendas!B22","v":"Otros gastos sociales tienda Barcelona 2"}]
[{"$f":"\"64900000\"&Tiendas!A23","v":"6490000063"},{"$f":"\"Otros gastos sociales tienda\"&\" \"&Tiendas!B23","v":"Otros gastos sociales tienda Barcelona 3"}]
[{"$f":"\"64900000\"&Tiendas!A24","v":"6490000064"},{"$f":"\"Otros gastos sociales tienda\"&\" \"&Tiendas!B24","v":"Otros gastos sociales tienda Barcelona 4"}]
[{"$f":"\"64900000\"&Tiendas!A25","v":"6490000071"},{"$f":"\"Otros gastos sociales tienda\"&\" \"&Tiendas!B25","v":"Otros gastos sociales tienda Bilbao 1"}]
[{"$f":"\"64900000\"&Tiendas!A26","v":"6490000072"},{"$f":"\"Otros gastos sociales tienda\"&\" \"&Tiendas!B26","v":"Otros gastos sociales tienda Bilbao 2"}]
[{"$f":"\"64900000\"&Tiendas!A27","v":"6490000080"},{"$f":"\"Otros gastos sociales tienda\"&\" \"&Tiendas!B27","v":"Otros gastos sociales tienda Almacén"}]
["65.","OTROS GASTOS DE GESTIÓN"]
[650,"PÉRDIDAS DE CRÉDITOS COMERCIALES INCOBRABLES"]
[651,"RESULTADOS DE OPERACIONES EN COMÚN"]
[6510,"BENEFICIO TRANSFERIDO (GESTOR)"]
[6511,"PÉRDIDA SOPORTADA (PARTÍCIPE O ASOCIADO NO GESTOR)"]
[659,"OTRAS PÉRDIDAS EN GESTIÓN CORRIENTE"]
[{"$f":"\"65900000\"&Tiendas!A2","v":"6590000011"},{"$f":"\"Otras pérdidas en gestión corriente tienda\"&\" \"&Tiendas!B2","v":"Otras pérdidas en gestión corriente tienda A Coruña 1"}]
[{"$f":"\"65900000\"&Tiendas!A3","v":"6590000012"},{"$f":"\"Otras pérdidas en gestión corriente tienda\"&\" \"&Tiendas!B3","v":"Otras pérdidas en gestión corriente tienda A Coruña 2"}]
[{"$f":"\"65900000\"&Tiendas!A4","v":"6590000013"},{"$f":"\"Otras pérdidas en gestión corriente tienda\"&\" \"&Tiendas!B4","v":"Otras pérdidas en gestión corriente tienda A Coruña 3"}]
[{"$f":"\"65900000\"&Tiendas!A5","v":"6590000014"},{"$f":"\"Otras pérdidas en gestión corriente tienda\"&\" \"&Tiendas!B5","v":"Otras pérdidas en gestión corriente tienda A Coruña 4"}]
[{"$f":"\"65900000\"&Tiendas!A6","v":"6590000015"},{"$f":"\"Otras pérdidas en gestión corriente tienda\"&\" \"&Tiendas!B6","v":"Otras pérdidas en gestión corriente tienda A Coruña 5"}]
[{"$f":"\"65900000\"&Tiendas!A7","v":"6590000021"},{"$f":"\"Otras pérdidas en gestión corriente tienda\"&\" \"&Tiendas!B7","v":"Otras pérdidas en gestión corriente tienda Lugo 1"}]
[{"$f":"\"65900000\"&Tiendas!A8","v":"6590000022"},{"$f":"\"Otras pérdidas en gestión corriente tienda\"&\" \"&Tiendas!B8","v":"Otras pérdidas en gestión corriente tienda Lugo 2"}]
[{"$f":"\"65900000\"&Tiendas!A9","v":"6590000031"},{"$f":"\"Otras pérdidas en gestión corriente tienda\"&\" \"&Tiendas!B9","v":"Otras pérdidas en gestión corriente tienda Ourense 1"}]
[{"$f":"\"65900000\"&Tiendas!A10","v":"6590000032"},{"$f":"\"Otras pérdidas en gestión corriente tienda\"&\" \"&Tiendas!B10","v":"Otras pérdidas en gestión corriente tienda Ourense 2"}]
[{"$f":"\"65900000\"&Tiendas!A11","v":"6590000033"},{"$f":"\"Otras pérdidas en gestión corriente tienda\"&\" \"&Tiendas!B11","v":"Otras pérdidas en gestión corriente tienda Ourense 3"}]
[{"$f":"\"65900000\"&Tiendas!A12","v":"6590000041"},{"$f":"\"Otras pérdidas en gestión corriente tienda\"&\" \"&Tiendas!B12","v":"Otras pérdidas en gestión corriente tienda Pontevedra 1"}]
[{"$f":"\"65900000\"&Tiendas!A13","v":"6590000042"},{"$f":"\"Otras pérdidas en gestión corriente tienda\"&\" \"&Tiendas!B13","v":"Otras pérdidas en gestión corriente tienda Pontevedra 2"}]
[{"$f":"\"65900000\"&Tiendas!A14","v":"6590000043"},{"$f":"\"Otras pérdidas en gestión corriente tienda\"&\" \"&Tiendas!B14","v":"Otras pérdidas en gestión corriente tienda Pontevedra 3"}]
[{"$f":"\"65900000\"&Tiendas!A15","v":"6590000044"},{"$f":"\"Otras pérdidas en gestión corriente tienda\"&\" \"&Tiendas!B15","v":"Otras pérdidas en gestión corriente tienda Pontevedra 4"}]
[{"$f":"\"65900000\"&Tiendas!A16","v":"6590000051"},{"$f":"\"Otras pérdidas en gestión corriente tienda\"&\" \"&Tiendas!B16","v":"Otras pérdidas en gestión corriente tienda Madrid 1"}]
[{"$f":"\"65900000\"&Tiendas!A17","v":"6590000052"},{"$f":"\"Otras pérdidas en gestión corriente tienda\"&\" \"&Tiendas!B17","v":"Otras pérdidas en gestión corriente tienda Madrid 2"}]
[{"$f":"\"65900000\"&Tiendas!A18","v":"6590000053"},{"$f":"\"Otras pérdidas en gestión corriente tienda\"&\" \"&Tiendas!B18","v":"Otras pérdidas en gestión corriente tienda Madrid 3"}]
[{"$f":"\"65900000\"&Tiendas!A19","v":"6590000054"},{"$f":"\"Otras pérdidas en gestión corriente tienda\"&\" \"&Tiendas!B19","v":"Otras pérdidas en gestión corriente tienda Madrid 4"}]
[{"$f":"\"65900000\"&Tiendas!A20","v":"6590000055"},{"$f":"\"Otras pérdidas en gestión corriente tienda\"&\" \"&Tiendas!B20","v":"Otras pérdidas en gestión corriente tienda Madrid 5"}]
[{"$f":"\"65900000\"&Tiendas!A21","v":"6590000061"},{"$f":"\"Otras pérdidas en gestión corriente tienda\"&\" \"&Tiendas!B21","v":"Otras pérdidas en gestión corriente tienda Barcelona 1"}]
[{"$f":"\"65900000\"&Tiendas!A22","v":"6590000062"},{"$f":"\"Otras pérdidas en gestión corriente tienda\"&\" \"&Tiendas!B22","v":"Otras pérdidas en gestión corriente tienda Barcelona 2"}]
[{"$f":"\"65900000\"&Tiendas!A23","v":"6590000063"},{"$f":"\"Otras pérdidas en gestión corriente tienda\"&\" \"&Tiendas!B23","v":"Otras pérdidas en gestión corriente tienda Barcelona 3"}]
[{"$f":"\"65900000\"&Tiendas!A24","v":"6590000064"},{"$f":"\"Otras pérdidas en gestión corriente tienda\"&\" \"&Tiendas!B24","v":"Otras pérdidas en gestión corriente tienda Barcelona 4"}]
[{"$f":"\"65900000\"&Tiendas!A25","v":"6590000071"},{"$f":"\"Otras pérdidas en gestión corriente tienda\"&\" \"&Tiendas!B25","v":"Otras pérdidas en gestión corriente tienda Bilbao 1"}]
[{"$f":"\"65900000\"&Tiendas!A26","v":"6590000072"},{"$f":"\"Otras pérdidas en gestión corriente tienda\"&\" \"&Tiendas!B26","v":"Otras pérdidas en gestión corriente tienda Bilbao 2"}]
[{"$f":"\"65900000\"&Tiendas!A27","v":"6590000080"},{"$f":"\"Otras pérdidas en gestión corriente tienda\"&\" \"&Tiendas!B27","v":"Otras pérdidas en gestión corriente tienda Almacén"}]
["66.","GASTOS FINANCIEROS "]
[660,"GASTOS FINANCIEROS POR ACTUALIZACIÓN DE PROVEISONES"]
[661,"INTERESES DE OBLIGACIONES Y BONOS"]
[6610,"INTERESES DE OBLIGACIONES Y BONOS A LARGO PLAZO, EMPRESAS DEL GRUPO"]
[6611,"INTERESES DE OBLIGACIONES Y BONOS A LARGO PLAZO, EMPRESAS ASOCIADAS"]
[6612,"INTERESES DE OBLIGACIONES Y BONOS A LARGO PLAZO, OTRAS PARTES VINCULADAS"]
[6613,"INTERESES DE OBLIGACIONES Y BONOS A LARGO PLAZO, OTRAS EMPRESAS"]
[6615,"INTERESES DE OBLIGACIONES Y BONOS A CORTO PLAZO, EMPRESAS DEL GRUPO"]
[6616,"INTERESES DE OBLIGACIONES Y BONOS A CORTO PLAZO, EMPRESAS ASOCIADAS"]
[6617,"INTERESES DE OBLIGACIONES Y BONOS A CORTO PLAZO, OTRAS PARTES VINCULADAS"]
[6618,"INTERESES DE OBLIGACIONES Y BONOS A CORTO PLAZO, OTRAS EMPRESAS"]
[662,"INTERESES DE DEUDAS"]
[6620,"INTERESES DE DEUDAS, EMPRESAS DEL GRUPO"]
[6621,"INTERESES DE DEUDAS, EMPRESAS ASOCIADAS"]
[6622,"INTERESES DE DEUDAS, OTRAS PARTES VINCULADAS"]
[6623,"INTERESES DE DEUDAS CON ENTIDADES DE CRÉDITO"]
[6624,"INTERESES DE DEUDAS, OTRAS EMPRESAS"]
[663,"PÉRDIDAS POR VALORACIÓN DE ACTIVOS Y PASIVOS FINANCIEROS POR SU VALOR RAZONABLE"]
[664,"DIVIDENDOS DE ACCIONES O PARTICIPACIONES CONSIDERADAS COMO PASIVOS FINANCIEROS"]
[6640,"DIVIDENDOS DE PASIVOS, EMPRESAS DEL GRUPO"]
[6641,"DIVIDENDOS DE PASIVOS, EMPRESAS ASOCIADAS"]
[6642,"DIVIDENDOS DE PASIVOS, OTRAS PARTES VINCULADAS"]
[6643,"DIVIDENDOS DE PASIVOS, OTRAS EMPRESAS"]
[665,"INTERESES POR DESCUENTO DE EFECTOS Y OPERACIONES DE \"FACTORING\""]
[6650,"INTERESES POR DESCUENTO DE EFECTOS EN ENTIDADES DE CRÉDITO DEL GRUPO"]
[6651,"INTERESES POR DESCUENTO DE EFECTOS EN ENTIDADES DE CRÉDITO ASOCIADAS"]
[6652,"INTERESES POR DESCUENTO DE EFECTOS EN OTRAS ENTIDADES DE CRÉDITO VINCULADAS"]
[6653,"INTERESES POR DESCUENTO DE EFECTOS EN OTRAS ENTIDADES DE CRÉDITO"]
[6654,"INTERESES POR OPERACIONES DE \"FACTORING\" CON ENTIDADES DE CRÉDITO DEL GRUPO"]
[6655,"INTERESES POR OPERACIONES DE \"FACTORING\" CON ENTIDADES DE CRÉDITO ASOCIADAS"]
[6656,"INTERESES POR OPERACIONES DE \"FACTORING\" CON OTRAS ENTIDADES DE CRÉDITO VINCULADAS"]
[6657,"INTERESES POR OPERACIONES DE \"FACTORING\" CON OTRAS ENTIDADES DE CRÉDITO"]
[666,"PÉRDIDAS EN PARTICIPACIONES Y VALORES REPRESENTATIVOS DE DEUDA"]
[6660,"PÉRDIDAS EN VALORES REPRESENTATIVOS DE DEUDA A LARGO PLAZO, EMPRESAS DEL GRUPO"]
[6661,"PÉRDIDAS EN VALORES REPRESENTATIVOS DE DEUDA A LARGO PLAZO, EMPRESAS ASOCIADAS"]
[6662,"PÉRDIDAS EN VALORES REPRESENTATIVOS DE DEUDA A LARGO PLAZO, OTRAS PARTES VINCULADAS"]
[6663,"PÉRDIDAS EN PARTICIPACIONES Y VALORES REPRESENTATIVOS DE DEUDA A LARGO PLAZO, OTRAS EMPRESAS"]
[6665,"PÉRDIDAS EN PARTICIPACIONES Y VALORES REPRESENTATIVOS DE DEUDA A CORTO PLAZO, EMPRESAS DEL GRUPO"]
[6666,"PÉRDIDAS EN PARTICIPACIONES Y VALORES REPRESENTATIVOS DE DEUDA A CORTO PLAZO, EMPRESAS ASOCIADAS"]
[6667,"PÉRDIDAS EN VALORES REPRESENTATIVOS DE DEUDA A CORTO PLAZO, OTRAS PARTES VINCULADAS"]
[6668,"PÉRDIDAS EN VALORES REPESENTATIVOS DE DEUDA A CORTO PLAZO, OTRAS EMPRESAS"]
[667,"PÉRDIDAS DE CRÉDITOS NO COMERCIALES"]
[6670,"PÉRDIDAS DE CRÉDITOS A LARGO PLAZO, EMPRESAS DEL GRUPO"]
[6671,"PÉRDIDAS DE CRÉDITOS A LARGO PLAZO, EMPRESAS ASOCIADAS"]
[6672,"PÉRDIDAS DE CRÉDITOS A LARGO PLAZO, OTRAS PARTES VINCULADAS"]
[6673,"PÉRDIDAS DE CRÉDITOS A LARGO PLAZO, OTRAS EMPRESAS"]
[6675,"PÉRDIDAS DE CRÉDITOS A CORTO PLAZO, EMPRESAS DEL GRUPO"]
[6676,"PÉRDIDAS DE CRÉDITOS A CORTO PLAZO, EMPRESAS ASOCIADAS"]
[6677,"PÉRDIDAS DE CRÉDITOS A CORTO PLAZO, OTRAS PARTES VINCULADAS"]
[6678,"PÉRDIDAS DE CRÉDITOS A CORTO PLAZO, DE OTRAS EMPRESAS"]
[668,"DIFERENCIAS NEGATIVAS DE CAMBIO"]
[669,"OTROS GASTOS FINANCIEROS"]
[{"$f":"Tarjetas!D2","v":"6690000001"},{"$f":"\"Comisión Tarjeta \"&Tarjetas!B2","v":"Comisión Tarjeta Visa"}]
[{"$f":"Tarjetas!D3","v":"6690000002"},{"$f":"\"Comisión Tarjeta \"&Tarjetas!B3","v":"Comisión Tarjeta Master Card"}]
[{"$f":"Tarjetas!D4","v":"6690000003"},{"$f":"\"Comisión Tarjeta \"&Tarjetas!B4","v":"Comisión Tarjeta American Express"}]
[{"$f":"Tarjetas!D5","v":"6690000004"},{"$f":"\"Comisión Tarjeta \"&Tarjetas!B5","v":"Comisión Tarjeta 4B"}]
["67.","PÉRDIDAS PROCEDENTES DE ACTIVOS NO CORRIENTES Y GASTOS EXCEPCIONALES"]
[670,"PÉRDIDAS PROCEDENTES DEL INMOVILIZADO INTANGIBLE"]
[671,"PÉRDIDAS PROCEDENTES DEL INMOVILIZADO MATERIAL"]
[672,"PÉRDIDAS PROCEDENTES DE LAS INVERSIONES INMOBILIARIAS"]
[673,"PÉRDIDAS PROCEDENTES DE PARTICIPACIONES A LARGO PLAZO EN PARTES VINCULADAS"]
[6733,"PÉRDIDAS PROCEDENTES DE PARTICIPACIONES A LARGO PLAZO, EMPRESAS DEL GRUPO"]
[6734,"PÉRDIDAS PROCEDENTES DE PARTICIPACIONES A LARGO PLAZO, EMPRESAS ASOCIADAS"]
[6735,"PÉRDIDAS PROCEDENTES DE PARTICIPACIONES A LARGO PLAZO, OTRAS PARTES VINCULADAS"]
[675,"PÉRDIDAS POR OPERACIONES CON OBLIGACIONES PROPIAS"]
[678,"GASTOS EXCEPCIONALES"]
["68.","DOTACIONES PARA AMORTIZADO"]
[680,"AMORTIZACIÓN DEL INMOVILIZADO INTANGIBLE"]
[6806000001,"Amortización programa de TPV"]
[681,"AMORTIZACIÓN DEL INMOVILIZADO MATERIAL"]
[6813,"AMORTIZACIÓN DE MAQUINARIA"]
[6813000001,"Amortización carretillo elevador"]
[6813000002,"Amortización plastificadora"]
[6813000003,"Amortización etiquetadora"]
[6813000004,"Amortización cinta transportadora"]
[6813000005,"Amortización transpaletadora"]
[6814,"AMORTIZACIÓN DE UTILLAJE"]
[6814000001,"Amortización utillaje tiendas"]
[6814000002,"Amortización utillaje almacén"]
[6816,"AMORTIZACIÓN DE MOBILIARIO"]
[6816000001,"Amortización mobiliario tiendas"]
[6816000002,"Amortización mobiliario almacén"]
[6817,"AMORTIZACIÓN DE EQUIPOS PARA PROCESOS DE INFORMACIÓN"]
[68170001,"Amortización Ordenadores"]
[{"$f":"\"6817000\"&Tiendas!A2&\"1\"","v":"6817000111"},{"$f":"\"Amortización\"&\" \"&\"Ordenadores Tienda\"&\" \"&Tiendas!B2","v":"Amortización Ordenadores Tienda A Coruña 1"}]
[{"$f":"\"6817000\"&Tiendas!A3&\"1\"","v":"6817000121"},{"$f":"\"Amortización\"&\" \"&\"Ordenadores Tienda\"&\" \"&Tiendas!B3","v":"Amortización Ordenadores Tienda A Coruña 2"}]
[{"$f":"\"6817000\"&Tiendas!A4&\"1\"","v":"6817000131"},{"$f":"\"Amortización\"&\" \"&\"Ordenadores Tienda\"&\" \"&Tiendas!B4","v":"Amortización Ordenadores Tienda A Coruña 3"}]
[{"$f":"\"6817000\"&Tiendas!A5&\"1\"","v":"6817000141"},{"$f":"\"Amortización\"&\" \"&\"Ordenadores Tienda\"&\" \"&Tiendas!B5","v":"Amortización Ordenadores Tienda A Coruña 4"}]
[{"$f":"\"6817000\"&Tiendas!A6&\"1\"","v":"6817000151"},{"$f":"\"Amortización\"&\" \"&\"Ordenadores Tienda\"&\" \"&Tiendas!B6","v":"Amortización Ordenadores Tienda A Coruña 5"}]
[{"$f":"\"6817000\"&Tiendas!A7&\"1\"","v":"6817000211"},{"$f":"\"Amortización\"&\" \"&\"Ordenadores Tienda\"&\" \"&Tiendas!B7","v":"Amortización Ordenadores Tienda Lugo 1"}]
[{"$f":"\"6817000\"&Tiendas!A8&\"1\"","v":"6817000221"},{"$f":"\"Amortización\"&\" \"&\"Ordenadores Tienda\"&\" \"&Tiendas!B8","v":"Amortización Ordenadores Tienda Lugo 2"}]
[{"$f":"\"6817000\"&Tiendas!A9&\"1\"","v":"6817000311"},{"$f":"\"Amortización\"&\" \"&\"Ordenadores Tienda\"&\" \"&Tiendas!B9","v":"Amortización Ordenadores Tienda Ourense 1"}]
[{"$f":"\"6817000\"&Tiendas!A10&\"1\"","v":"6817000321"},{"$f":"\"Amortización\"&\" \"&\"Ordenadores Tienda\"&\" \"&Tiendas!B10","v":"Amortización Ordenadores Tienda Ourense 2"}]
[{"$f":"\"6817000\"&Tiendas!A11&\"1\"","v":"6817000331"},{"$f":"\"Amortización\"&\" \"&\"Ordenadores Tienda\"&\" \"&Tiendas!B11","v":"Amortización Ordenadores Tienda Ourense 3"}]
[{"$f":"\"6817000\"&Tiendas!A12&\"1\"","v":"6817000411"},{"$f":"\"Amortización\"&\" \"&\"Ordenadores Tienda\"&\" \"&Tiendas!B12","v":"Amortización Ordenadores Tienda Pontevedra 1"}]
[{"$f":"\"6817000\"&Tiendas!A13&\"1\"","v":"6817000421"},{"$f":"\"Amortización\"&\" \"&\"Ordenadores Tienda\"&\" \"&Tiendas!B13","v":"Amortización Ordenadores Tienda Pontevedra 2"}]
[{"$f":"\"6817000\"&Tiendas!A14&\"1\"","v":"6817000431"},{"$f":"\"Amortización\"&\" \"&\"Ordenadores Tienda\"&\" \"&Tiendas!B14","v":"Amortización Ordenadores Tienda Pontevedra 3"}]
[{"$f":"\"6817000\"&Tiendas!A15&\"1\"","v":"6817000441"},{"$f":"\"Amortización\"&\" \"&\"Ordenadores Tienda\"&\" \"&Tiendas!B15","v":"Amortización Ordenadores Tienda Pontevedra 4"}]
[{"$f":"\"6817000\"&Tiendas!A16&\"1\"","v":"6817000511"},{"$f":"\"Amortización\"&\" \"&\"Ordenadores Tienda\"&\" \"&Tiendas!B16","v":"Amortización Ordenadores Tienda Madrid 1"}]
[{"$f":"\"6817000\"&Tiendas!A17&\"1\"","v":"6817000521"},{"$f":"\"Amortización\"&\" \"&\"Ordenadores Tienda\"&\" \"&Tiendas!B17","v":"Amortización Ordenadores Tienda Madrid 2"}]
[{"$f":"\"6817000\"&Tiendas!A18&\"1\"","v":"6817000531"},{"$f":"\"Amortización\"&\" \"&\"Ordenadores Tienda\"&\" \"&Tiendas!B18","v":"Amortización Ordenadores Tienda Madrid 3"}]
[{"$f":"\"6817000\"&Tiendas!A19&\"1\"","v":"6817000541"},{"$f":"\"Amortización\"&\" \"&\"Ordenadores Tienda\"&\" \"&Tiendas!B19","v":"Amortización Ordenadores Tienda Madrid 4"}]
[{"$f":"\"6817000\"&Tiendas!A20&\"1\"","v":"6817000551"},{"$f":"\"Amortización\"&\" \"&\"Ordenadores Tienda\"&\" \"&Tiendas!B20","v":"Amortización Ordenadores Tienda Madrid 5"}]
[{"$f":"\"6817000\"&Tiendas!A21&\"1\"","v":"6817000611"},{"$f":"\"Amortización\"&\" \"&\"Ordenadores Tienda\"&\" \"&Tiendas!B21","v":"Amortización Ordenadores Tienda Barcelona 1"}]
[{"$f":"\"6817000\"&Tiendas!A22&\"1\"","v":"6817000621"},{"$f":"\"Amortización\"&\" \"&\"Ordenadores Tienda\"&\" \"&Tiendas!B22","v":"Amortización Ordenadores Tienda Barcelona 2"}]
[{"$f":"\"6817000\"&Tiendas!A23&\"1\"","v":"6817000631"},{"$f":"\"Amortización\"&\" \"&\"Ordenadores Tienda\"&\" \"&Tiendas!B23","v":"Amortización Ordenadores Tienda Barcelona 3"}]
[{"$f":"\"6817000\"&Tiendas!A24&\"1\"","v":"6817000641"},{"$f":"\"Amortización\"&\" \"&\"Ordenadores Tienda\"&\" \"&Tiendas!B24","v":"Amortización Ordenadores Tienda Barcelona 4"}]
[{"$f":"\"6817000\"&Tiendas!A25&\"1\"","v":"6817000711"},{"$f":"\"Amortización\"&\" \"&\"Ordenadores Tienda\"&\" \"&Tiendas!B25","v":"Amortización Ordenadores Tienda Bilbao 1"}]
[{"$f":"\"6817000\"&Tiendas!A26&\"1\"","v":"6817000721"},{"$f":"\"Amortización\"&\" \"&\"Ordenadores Tienda\"&\" \"&Tiendas!B26","v":"Amortización Ordenadores Tienda Bilbao 2"}]
[{"$f":"\"6817000\"&Tiendas!A27&\"1\"","v":"6817000801"},{"$f":"\"Amortización\"&\" \"&\"Ordenadores Tienda\"&\" \"&Tiendas!B27","v":"Amortización Ordenadores Tienda Almacén"}]
[68170001,"Amortización TPV"]
[{"$f":"\"6817000\"&Tiendas!A2&2","v":"6817000112"},{"$f":"\"Amortización\"&\" \"&\"TPV\"&\" \"&Tiendas!B2","v":"Amortización TPV A Coruña 1"}]
[{"$f":"\"6817000\"&Tiendas!A3&2","v":"6817000122"},{"$f":"\"Amortización\"&\" \"&\"TPV\"&\" \"&Tiendas!B3","v":"Amortización TPV A Coruña 2"}]
[{"$f":"\"6817000\"&Tiendas!A4&2","v":"6817000132"},{"$f":"\"Amortización\"&\" \"&\"TPV\"&\" \"&Tiendas!B4","v":"Amortización TPV A Coruña 3"}]
[{"$f":"\"6817000\"&Tiendas!A5&2","v":"6817000142"},{"$f":"\"Amortización\"&\" \"&\"TPV\"&\" \"&Tiendas!B5","v":"Amortización TPV A Coruña 4"}]
[{"$f":"\"6817000\"&Tiendas!A6&2","v":"6817000152"},{"$f":"\"Amortización\"&\" \"&\"TPV\"&\" \"&Tiendas!B6","v":"Amortización TPV A Coruña 5"}]
[{"$f":"\"6817000\"&Tiendas!A7&2","v":"6817000212"},{"$f":"\"Amortización\"&\" \"&\"TPV\"&\" \"&Tiendas!B7","v":"Amortización TPV Lugo 1"}]
[{"$f":"\"6817000\"&Tiendas!A8&2","v":"6817000222"},{"$f":"\"Amortización\"&\" \"&\"TPV\"&\" \"&Tiendas!B8","v":"Amortización TPV Lugo 2"}]
[{"$f":"\"6817000\"&Tiendas!A9&2","v":"6817000312"},{"$f":"\"Amortización\"&\" \"&\"TPV\"&\" \"&Tiendas!B9","v":"Amortización TPV Ourense 1"}]
[{"$f":"\"6817000\"&Tiendas!A10&2","v":"6817000322"},{"$f":"\"Amortización\"&\" \"&\"TPV\"&\" \"&Tiendas!B10","v":"Amortización TPV Ourense 2"}]
[{"$f":"\"6817000\"&Tiendas!A11&2","v":"6817000332"},{"$f":"\"Amortización\"&\" \"&\"TPV\"&\" \"&Tiendas!B11","v":"Amortización TPV Ourense 3"}]
[{"$f":"\"6817000\"&Tiendas!A12&2","v":"6817000412"},{"$f":"\"Amortización\"&\" \"&\"TPV\"&\" \"&Tiendas!B12","v":"Amortización TPV Pontevedra 1"}]
[{"$f":"\"6817000\"&Tiendas!A13&2","v":"6817000422"},{"$f":"\"Amortización\"&\" \"&\"TPV\"&\" \"&Tiendas!B13","v":"Amortización TPV Pontevedra 2"}]
[{"$f":"\"6817000\"&Tiendas!A14&2","v":"6817000432"},{"$f":"\"Amortización\"&\" \"&\"TPV\"&\" \"&Tiendas!B14","v":"Amortización TPV Pontevedra 3"}]
[{"$f":"\"6817000\"&Tiendas!A15&2","v":"6817000442"},{"$f":"\"Amortización\"&\" \"&\"TPV\"&\" \"&Tiendas!B15","v":"Amortización TPV Pontevedra 4"}]
[{"$f":"\"6817000\"&Tiendas!A16&2","v":"6817000512"},{"$f":"\"Amortización\"&\" \"&\"TPV\"&\" \"&Tiendas!B16","v":"Amortización TPV Madrid 1"}]
[{"$f":"\"6817000\"&Tiendas!A17&2","v":"6817000522"},{"$f":"\"Amortización\"&\" \"&\"TPV\"&\" \"&Tiendas!B17","v":"Amortización TPV Madrid 2"}]
[{"$f":"\"6817000\"&Tiendas!A18&2","v":"6817000532"},{"$f":"\"Amortización\"&\" \"&\"TPV\"&\" \"&Tiendas!B18","v":"Amortización TPV Madrid 3"}]
[{"$f":"\"6817000\"&Tiendas!A19&2","v":"6817000542"},{"$f":"\"Amortización\"&\" \"&\"TPV\"&\" \"&Tiendas!B19","v":"Amortización TPV Madrid 4"}]
[{"$f":"\"6817000\"&Tiendas!A20&2","v":"6817000552"},{"$f":"\"Amortización\"&\" \"&\"TPV\"&\" \"&Tiendas!B20","v":"Amortización TPV Madrid 5"}]
[{"$f":"\"6817000\"&Tiendas!A21&2","v":"6817000612"},{"$f":"\"Amortización\"&\" \"&\"TPV\"&\" \"&Tiendas!B21","v":"Amortización TPV Barcelona 1"}]
[{"$f":"\"6817000\"&Tiendas!A22&2","v":"6817000622"},{"$f":"\"Amortización\"&\" \"&\"TPV\"&\" \"&Tiendas!B22","v":"Amortización TPV Barcelona 2"}]
[{"$f":"\"6817000\"&Tiendas!A23&2","v":"6817000632"},{"$f":"\"Amortización\"&\" \"&\"TPV\"&\" \"&Tiendas!B23","v":"Amortización TPV Barcelona 3"}]
[{"$f":"\"6817000\"&Tiendas!A24&2","v":"6817000642"},{"$f":"\"Amortización\"&\" \"&\"TPV\"&\" \"&Tiendas!B24","v":"Amortización TPV Barcelona 4"}]
[{"$f":"\"6817000\"&Tiendas!A25&2","v":"6817000712"},{"$f":"\"Amortización\"&\" \"&\"TPV\"&\" \"&Tiendas!B25","v":"Amortización TPV Bilbao 1"}]
[{"$f":"\"6817000\"&Tiendas!A26&2","v":"6817000722"},{"$f":"\"Amortización\"&\" \"&\"TPV\"&\" \"&Tiendas!B26","v":"Amortización TPV Bilbao 2"}]
[{"$f":"\"6817000\"&Tiendas!A27&2","v":"6817000802"},{"$f":"\"Amortización\"&\" \"&\"TPV\"&\" \"&Tiendas!B27","v":"Amortización TPV Almacén"}]
[6818,"AMORTIZACIÓN DE ELEMENTOS DE TRANSPORTE"]
[{"$f":"\"68180000\"&Zonas!A4&\"1\"","v":"6818000011"},{"$f":"\"Amortización\"&\" \"&\"camión\"&\" \"&Zonas!B4","v":"Amortización camión Galicia"}]
[{"$f":"\"68180000\"&Zonas!A5&\"1\"","v":"6818000021"},{"$f":"\"Amortización\"&\" \"&\"camión\"&\" \"&Zonas!B5","v":"Amortización camión Madrid"}]
[{"$f":"\"68180000\"&Zonas!A6&\"1\"","v":"6818000031"},{"$f":"\"Amortización\"&\" \"&\"camión\"&\" \"&Zonas!B6","v":"Amortización camión Barcelona/Bilbao"}]
[682,"AMORTIZACIÓN DE LAS INVERSIONES INMOBILIARIAS"]
["69.","PÉRDIDAS POR DETERIORO Y OTRAS DOTACIONES"]
[690,"PÉRDIDAS POR DETERIORO DEL INMOVILIZADO INTANGIBLE"]
[691,"PÉRDIDAS POR DETERIORO DEL INMOVILIZADO MATERIAL"]
[692,"PÉRDIDAS POR DETERIORO DE LAS INVERSIONES INMOBILIARIAS"]
[693,"PÉRDIDAS POR DETERIORO DE EXISTENCIAS"]
[6930,"PÉRDIDAS POR DETERIORO DE PRODUCTOS TERMINADOS Y EN CURSO DE FABRICACIÓN"]
[6931,"PÉRDIDAS POR DETERIORO DE MERCADERÍAS"]
[6932,"PÉRDIDAS POR DETERIORO DE MATERIAS PRIMAS"]
[6933,"PÉRDIDAS POR DETERIORO DE OTROS APROVISONAMIENTOS"]
[694,"PÉRDIDAS POR DETERIORO DE CRÉDITOS POR OPERACIONES COMERCIALES"]
[695,"DOTACIÓN A LA PROVISIÓN POR OPERACIONES COMERCIALES"]
[6954,"DOTACIÓN A LA PROVISIÓN POR CONTRATOS ONEROSOS"]
[6959,"DOTACIÓN A LA PROVISIÓN PARA OTRAS OPERACIONES COMERCIALES"]
[696,"PÉRDIDAS POR DETERIORO DE PARTICIPACIONES Y VALORES REPRESENTATIVOS DE DEUDA A LARGO PLAZO"]
[6960,"PÉRDIDAS POR DETERIORO DE PARTICIPACIONES EN INSTRUMENTOS DE PATRIMONIO NETO A LARGO PLAZO, EMPRESAS DEL GRUPO"]
[6961,"PÉRDIDAS POR DETERIORO DE PARTICIPACIONES EN INSTRUMENTOS DE PATRIMONIO NETO A LARGO PLAZO, EMPRESAS ASOCIADAS"]
[6962,"PÉRDIDAS POR DETERIORO DE PARTICIPACIONES EN INSTRUMENTOS DE PATRIMONIO NETO A LARGO PLAZO, OTRAS PARTES VINCULADAS"]
[6963,"PÉRDIDAS POR DETERIORO DE PARTICIPACIONES EN INSTRUMENTOS DE PATRIMONIO NETO A LARGO PLAZO, OTRAS EMPRESAS"]
[6965,"PÉRDIDAS POR DETERIORO EN VALORES REPRESENTATIVOS DE DEUDA A LARGO PLAZO, EMPRESAS DEL GRUPO"]
[6966,"PÉRDIDAS POR DETERIORO EN VALORES REPRESENTATIVOS DE DEUDA A LARGO PLAZO, EMPRESAS ASOCIADAS"]
[6967,"PÉRDIDAS POR DETERIORO EN VALORES REPRESENTATIVOS DE DEUDA A LARGO PLAZO, OTRAS PARTES VINCULADAS"]
[6968,"PÉRDIDAS POR DETERIORO EN VALORES REPRESENTATIVOS DE DEUDA A LARGO PLAZO, DE OTRAS EMPRESAS"]
[697,"PÉRDIDAS POR DETERIORO DE CRÉDITOS A LARGO PLAZO"]
[6970,"PÉRDIDAS POR DETERIORO DE CRÉDITOS A LARGO PLAZO, EMPRESAS DEL GRUPO"]
[6971,"PÉRDIDAS POR DETERIORO DE CRÉDITOS A LARGO PLAZO, EMPRESAS ASOCIADAS"]
[6972,"PÉRDIDAS POR DETERIORO DE CRÉDITOS A LARGO PLAZO, OTRAS PARTES VINCULADAS"]
[6973,"PÉRDIDAS POR DETERIORO DE CRÉDITOS A LARGO PLAZO, OTRAS EMPRESAS"]
[698,"PÉRDIDAS POR DETERIORO DE PARTICIPACIONES Y VALORES REPRESENTATIVOS DE DEUDA A CORTO PLAZO"]
[6980,"PÉRDIDAS POR DETERIORO DE PARTICIPACIONES EN INSTRUMENTOS DE PATRIMONIO NETO A CORTO PLAZO, EMPRESAS DEL GRUPO"]
[6981,"PÉRDIDAS POR DETERIORO DE PARTICIPACIONES EN INSTRUMENTOS DE PATRIMONIO NETO A CORTO PLAZO, EMPRESAS ASOCIADAS"]
[6985,"PÉRDIDAS POR DETERIORO EN VALORES REPRESENTATIVOS DE DEUDA A CORTO PLAZO, EMPRESAS DEL GRUPO"]
[6986,"PÉRDIDAS POR DETERIORO EN VALORES REPRESENTATIVOS DE DEUDA A CORTO PLAZO, EMPRESAS ASOCIADAS"]
[6987,"PÉRDIDAS POR DETERIORO EN VALORES REPRESENTATIVOS DE DEUDA A CORTO PLAZO, OTRAS PARTES VINCULADAS"]
[6988,"PÉRDIDAS POR DETERIORO EN VALORES REPRESENTATIVOS DE DEUDA A CORTO PLAZO, DE OTRAS EMPRESAS"]
[699,"PÉRDIDAS POR DETERIORO DE CRÉDITOS A CORTO PLAZO"]
[6990,"PÉRDIDAS POR DETERIORO DE CRÉDITOS A CORTO PLAZO, EMPRESAS DEL GRUPO"]
[6991,"PÉRDIDAS POR DETERIORO DE CRÉDITOS A CORTO PLAZO, EMPRESAS ASOCIADAS"]
[6992,"PÉRDIDAS POR DETERIORO DE CRÉDITOS A CORTO PLAZO, OTRAS PARTES VINCULADAS"]
[6993,"PÉRDIDAS POR DETERIORO DE CRÉDITOS A CORTO PLAZO, OTRAS EMPRESAS"]
["GRUPO 7","VENTAS E INGRESOS"]
["70.","VENTAS DE MERCADERÍAS, DE PRODUCCIÓN PROPIA, DE SERVICIOS, ETC."]
[700,"VENTAS DE MERCADERÍAS"]
[70000111,"Ventas producto mar"]
[{"$f":"\"70000\"&Familias!$A$3&Tiendas!A2","v":"7000011111"},{"$f":"\"Ventas producto mar tienda\"&\" \"&Tiendas!B2","v":"Ventas producto mar tienda A Coruña 1"}]
[{"$f":"\"70000\"&Familias!$A$3&Tiendas!A3","v":"7000011112"},{"$f":"\"Ventas producto mar tienda\"&\" \"&Tiendas!B3","v":"Ventas producto mar tienda A Coruña 2"}]
[{"$f":"\"70000\"&Familias!$A$3&Tiendas!A4","v":"7000011113"},{"$f":"\"Ventas producto mar tienda\"&\" \"&Tiendas!B4","v":"Ventas producto mar tienda A Coruña 3"}]
[{"$f":"\"70000\"&Familias!$A$3&Tiendas!A5","v":"7000011114"},{"$f":"\"Ventas producto mar tienda\"&\" \"&Tiendas!B5","v":"Ventas producto mar tienda A Coruña 4"}]
[{"$f":"\"70000\"&Familias!$A$3&Tiendas!A6","v":"7000011115"},{"$f":"\"Ventas producto mar tienda\"&\" \"&Tiendas!B6","v":"Ventas producto mar tienda A Coruña 5"}]
[{"$f":"\"70000\"&Familias!$A$3&Tiendas!A7","v":"7000011121"},{"$f":"\"Ventas producto mar tienda\"&\" \"&Tiendas!B7","v":"Ventas producto mar tienda Lugo 1"}]
[{"$f":"\"70000\"&Familias!$A$3&Tiendas!A8","v":"7000011122"},{"$f":"\"Ventas producto mar tienda\"&\" \"&Tiendas!B8","v":"Ventas producto mar tienda Lugo 2"}]
[{"$f":"\"70000\"&Familias!$A$3&Tiendas!A9","v":"7000011131"},{"$f":"\"Ventas producto mar tienda\"&\" \"&Tiendas!B9","v":"Ventas producto mar tienda Ourense 1"}]
[{"$f":"\"70000\"&Familias!$A$3&Tiendas!A10","v":"7000011132"},{"$f":"\"Ventas producto mar tienda\"&\" \"&Tiendas!B10","v":"Ventas producto mar tienda Ourense 2"}]
[{"$f":"\"70000\"&Familias!$A$3&Tiendas!A11","v":"7000011133"},{"$f":"\"Ventas producto mar tienda\"&\" \"&Tiendas!B11","v":"Ventas producto mar tienda Ourense 3"}]
[{"$f":"\"70000\"&Familias!$A$3&Tiendas!A12","v":"7000011141"},{"$f":"\"Ventas producto mar tienda\"&\" \"&Tiendas!B12","v":"Ventas producto mar tienda Pontevedra 1"}]
[{"$f":"\"70000\"&Familias!$A$3&Tiendas!A13","v":"7000011142"},{"$f":"\"Ventas producto mar tienda\"&\" \"&Tiendas!B13","v":"Ventas producto mar tienda Pontevedra 2"}]
[{"$f":"\"70000\"&Familias!$A$3&Tiendas!A14","v":"7000011143"},{"$f":"\"Ventas producto mar tienda\"&\" \"&Tiendas!B14","v":"Ventas producto mar tienda Pontevedra 3"}]
[{"$f":"\"70000\"&Familias!$A$3&Tiendas!A15","v":"7000011144"},{"$f":"\"Ventas producto mar tienda\"&\" \"&Tiendas!B15","v":"Ventas producto mar tienda Pontevedra 4"}]
[{"$f":"\"70000\"&Familias!$A$3&Tiendas!A16","v":"7000011151"},{"$f":"\"Ventas producto mar tienda\"&\" \"&Tiendas!B16","v":"Ventas producto mar tienda Madrid 1"}]
[{"$f":"\"70000\"&Familias!$A$3&Tiendas!A17","v":"7000011152"},{"$f":"\"Ventas producto mar tienda\"&\" \"&Tiendas!B17","v":"Ventas producto mar tienda Madrid 2"}]
[{"$f":"\"70000\"&Familias!$A$3&Tiendas!A18","v":"7000011153"},{"$f":"\"Ventas producto mar tienda\"&\" \"&Tiendas!B18","v":"Ventas producto mar tienda Madrid 3"}]
[{"$f":"\"70000\"&Familias!$A$3&Tiendas!A19","v":"7000011154"},{"$f":"\"Ventas producto mar tienda\"&\" \"&Tiendas!B19","v":"Ventas producto mar tienda Madrid 4"}]
[{"$f":"\"70000\"&Familias!$A$3&Tiendas!A20","v":"7000011155"},{"$f":"\"Ventas producto mar tienda\"&\" \"&Tiendas!B20","v":"Ventas producto mar tienda Madrid 5"}]
[{"$f":"\"70000\"&Familias!$A$3&Tiendas!A21","v":"7000011161"},{"$f":"\"Ventas producto mar tienda\"&\" \"&Tiendas!B21","v":"Ventas producto mar tienda Barcelona 1"}]
[{"$f":"\"70000\"&Familias!$A$3&Tiendas!A22","v":"7000011162"},{"$f":"\"Ventas producto mar tienda\"&\" \"&Tiendas!B22","v":"Ventas producto mar tienda Barcelona 2"}]
[{"$f":"\"70000\"&Familias!$A$3&Tiendas!A23","v":"7000011163"},{"$f":"\"Ventas producto mar tienda\"&\" \"&Tiendas!B23","v":"Ventas producto mar tienda Barcelona 3"}]
[{"$f":"\"70000\"&Familias!$A$3&Tiendas!A24","v":"7000011164"},{"$f":"\"Ventas producto mar tienda\"&\" \"&Tiendas!B24","v":"Ventas producto mar tienda Barcelona 4"}]
[{"$f":"\"70000\"&Familias!$A$3&Tiendas!A25","v":"7000011171"},{"$f":"\"Ventas producto mar tienda\"&\" \"&Tiendas!B25","v":"Ventas producto mar tienda Bilbao 1"}]
[{"$f":"\"70000\"&Familias!$A$3&Tiendas!A26","v":"7000011172"},{"$f":"\"Ventas producto mar tienda\"&\" \"&Tiendas!B26","v":"Ventas producto mar tienda Bilbao 2"}]
[{"$f":"\"70000\"&Familias!$A$3&Tiendas!A27","v":"7000011180"},{"$f":"\"Ventas producto mar tienda\"&\" \"&Tiendas!B27","v":"Ventas producto mar tienda Almacén"}]
[70000112,"Ventas producto campo"]
[{"$f":"\"70000\"&Familias!$A$4&Tiendas!A2","v":"7000011211"},{"$f":"\"Ventas producto campo tienda\"&\" \"&Tiendas!B2","v":"Ventas producto campo tienda A Coruña 1"}]
[{"$f":"\"70000\"&Familias!$A$4&Tiendas!A3","v":"7000011212"},{"$f":"\"Ventas producto campo tienda\"&\" \"&Tiendas!B3","v":"Ventas producto campo tienda A Coruña 2"}]
[{"$f":"\"70000\"&Familias!$A$4&Tiendas!A4","v":"7000011213"},{"$f":"\"Ventas producto campo tienda\"&\" \"&Tiendas!B4","v":"Ventas producto campo tienda A Coruña 3"}]
[{"$f":"\"70000\"&Familias!$A$4&Tiendas!A5","v":"7000011214"},{"$f":"\"Ventas producto campo tienda\"&\" \"&Tiendas!B5","v":"Ventas producto campo tienda A Coruña 4"}]
[{"$f":"\"70000\"&Familias!$A$4&Tiendas!A6","v":"7000011215"},{"$f":"\"Ventas producto campo tienda\"&\" \"&Tiendas!B6","v":"Ventas producto campo tienda A Coruña 5"}]
[{"$f":"\"70000\"&Familias!$A$4&Tiendas!A7","v":"7000011221"},{"$f":"\"Ventas producto campo tienda\"&\" \"&Tiendas!B7","v":"Ventas producto campo tienda Lugo 1"}]
[{"$f":"\"70000\"&Familias!$A$4&Tiendas!A8","v":"7000011222"},{"$f":"\"Ventas producto campo tienda\"&\" \"&Tiendas!B8","v":"Ventas producto campo tienda Lugo 2"}]
[{"$f":"\"70000\"&Familias!$A$4&Tiendas!A9","v":"7000011231"},{"$f":"\"Ventas producto campo tienda\"&\" \"&Tiendas!B9","v":"Ventas producto campo tienda Ourense 1"}]
[{"$f":"\"70000\"&Familias!$A$4&Tiendas!A10","v":"7000011232"},{"$f":"\"Ventas producto campo tienda\"&\" \"&Tiendas!B10","v":"Ventas producto campo tienda Ourense 2"}]
[{"$f":"\"70000\"&Familias!$A$4&Tiendas!A11","v":"7000011233"},{"$f":"\"Ventas producto campo tienda\"&\" \"&Tiendas!B11","v":"Ventas producto campo tienda Ourense 3"}]
[{"$f":"\"70000\"&Familias!$A$4&Tiendas!A12","v":"7000011241"},{"$f":"\"Ventas producto campo tienda\"&\" \"&Tiendas!B12","v":"Ventas producto campo tienda Pontevedra 1"}]
[{"$f":"\"70000\"&Familias!$A$4&Tiendas!A13","v":"7000011242"},{"$f":"\"Ventas producto campo tienda\"&\" \"&Tiendas!B13","v":"Ventas producto campo tienda Pontevedra 2"}]
[{"$f":"\"70000\"&Familias!$A$4&Tiendas!A14","v":"7000011243"},{"$f":"\"Ventas producto campo tienda\"&\" \"&Tiendas!B14","v":"Ventas producto campo tienda Pontevedra 3"}]
[{"$f":"\"70000\"&Familias!$A$4&Tiendas!A15","v":"7000011244"},{"$f":"\"Ventas producto campo tienda\"&\" \"&Tiendas!B15","v":"Ventas producto campo tienda Pontevedra 4"}]
[{"$f":"\"70000\"&Familias!$A$4&Tiendas!A16","v":"7000011251"},{"$f":"\"Ventas producto campo tienda\"&\" \"&Tiendas!B16","v":"Ventas producto campo tienda Madrid 1"}]
[{"$f":"\"70000\"&Familias!$A$4&Tiendas!A17","v":"7000011252"},{"$f":"\"Ventas producto campo tienda\"&\" \"&Tiendas!B17","v":"Ventas producto campo tienda Madrid 2"}]
[{"$f":"\"70000\"&Familias!$A$4&Tiendas!A18","v":"7000011253"},{"$f":"\"Ventas producto campo tienda\"&\" \"&Tiendas!B18","v":"Ventas producto campo tienda Madrid 3"}]
[{"$f":"\"70000\"&Familias!$A$4&Tiendas!A19","v":"7000011254"},{"$f":"\"Ventas producto campo tienda\"&\" \"&Tiendas!B19","v":"Ventas producto campo tienda Madrid 4"}]
[{"$f":"\"70000\"&Familias!$A$4&Tiendas!A20","v":"7000011255"},{"$f":"\"Ventas producto campo tienda\"&\" \"&Tiendas!B20","v":"Ventas producto campo tienda Madrid 5"}]
[{"$f":"\"70000\"&Familias!$A$4&Tiendas!A21","v":"7000011261"},{"$f":"\"Ventas producto campo tienda\"&\" \"&Tiendas!B21","v":"Ventas producto campo tienda Barcelona 1"}]
[{"$f":"\"70000\"&Familias!$A$4&Tiendas!A22","v":"7000011262"},{"$f":"\"Ventas producto campo tienda\"&\" \"&Tiendas!B22","v":"Ventas producto campo tienda Barcelona 2"}]
[{"$f":"\"70000\"&Familias!$A$4&Tiendas!A23","v":"7000011263"},{"$f":"\"Ventas producto campo tienda\"&\" \"&Tiendas!B23","v":"Ventas producto campo tienda Barcelona 3"}]
[{"$f":"\"70000\"&Familias!$A$4&Tiendas!A24","v":"7000011264"},{"$f":"\"Ventas producto campo tienda\"&\" \"&Tiendas!B24","v":"Ventas producto campo tienda Barcelona 4"}]
[{"$f":"\"70000\"&Familias!$A$4&Tiendas!A25","v":"7000011271"},{"$f":"\"Ventas producto campo tienda\"&\" \"&Tiendas!B25","v":"Ventas producto campo tienda Bilbao 1"}]
[{"$f":"\"70000\"&Familias!$A$4&Tiendas!A26","v":"7000011272"},{"$f":"\"Ventas producto campo tienda\"&\" \"&Tiendas!B26","v":"Ventas producto campo tienda Bilbao 2"}]
[{"$f":"\"70000\"&Familias!$A$4&Tiendas!A27","v":"7000011280"},{"$f":"\"Ventas producto campo tienda\"&\" \"&Tiendas!B27","v":"Ventas producto campo tienda Almacén"}]
[70000113,"Ventas producto bebidas"]
[{"$f":"\"70000\"&Familias!$A$5&Tiendas!A2","v":"7000011311"},{"$f":"\"Ventas producto bebidas tienda\"&\" \"&Tiendas!B2","v":"Ventas producto bebidas tienda A Coruña 1"}]
[{"$f":"\"70000\"&Familias!$A$5&Tiendas!A3","v":"7000011312"},{"$f":"\"Ventas producto bebidas tienda\"&\" \"&Tiendas!B3","v":"Ventas producto bebidas tienda A Coruña 2"}]
[{"$f":"\"70000\"&Familias!$A$5&Tiendas!A4","v":"7000011313"},{"$f":"\"Ventas producto bebidas tienda\"&\" \"&Tiendas!B4","v":"Ventas producto bebidas tienda A Coruña 3"}]
[{"$f":"\"70000\"&Familias!$A$5&Tiendas!A5","v":"7000011314"},{"$f":"\"Ventas producto bebidas tienda\"&\" \"&Tiendas!B5","v":"Ventas producto bebidas tienda A Coruña 4"}]
[{"$f":"\"70000\"&Familias!$A$5&Tiendas!A6","v":"7000011315"},{"$f":"\"Ventas producto bebidas tienda\"&\" \"&Tiendas!B6","v":"Ventas producto bebidas tienda A Coruña 5"}]
[{"$f":"\"70000\"&Familias!$A$5&Tiendas!A7","v":"7000011321"},{"$f":"\"Ventas producto bebidas tienda\"&\" \"&Tiendas!B7","v":"Ventas producto bebidas tienda Lugo 1"}]
[{"$f":"\"70000\"&Familias!$A$5&Tiendas!A8","v":"7000011322"},{"$f":"\"Ventas producto bebidas tienda\"&\" \"&Tiendas!B8","v":"Ventas producto bebidas tienda Lugo 2"}]
[{"$f":"\"70000\"&Familias!$A$5&Tiendas!A9","v":"7000011331"},{"$f":"\"Ventas producto bebidas tienda\"&\" \"&Tiendas!B9","v":"Ventas producto bebidas tienda Ourense 1"}]
[{"$f":"\"70000\"&Familias!$A$5&Tiendas!A10","v":"7000011332"},{"$f":"\"Ventas producto bebidas tienda\"&\" \"&Tiendas!B10","v":"Ventas producto bebidas tienda Ourense 2"}]
[{"$f":"\"70000\"&Familias!$A$5&Tiendas!A11","v":"7000011333"},{"$f":"\"Ventas producto bebidas tienda\"&\" \"&Tiendas!B11","v":"Ventas producto bebidas tienda Ourense 3"}]
[{"$f":"\"70000\"&Familias!$A$5&Tiendas!A12","v":"7000011341"},{"$f":"\"Ventas producto bebidas tienda\"&\" \"&Tiendas!B12","v":"Ventas producto bebidas tienda Pontevedra 1"}]
[{"$f":"\"70000\"&Familias!$A$5&Tiendas!A13","v":"7000011342"},{"$f":"\"Ventas producto bebidas tienda\"&\" \"&Tiendas!B13","v":"Ventas producto bebidas tienda Pontevedra 2"}]
[{"$f":"\"70000\"&Familias!$A$5&Tiendas!A14","v":"7000011343"},{"$f":"\"Ventas producto bebidas tienda\"&\" \"&Tiendas!B14","v":"Ventas producto bebidas tienda Pontevedra 3"}]
[{"$f":"\"70000\"&Familias!$A$5&Tiendas!A15","v":"7000011344"},{"$f":"\"Ventas producto bebidas tienda\"&\" \"&Tiendas!B15","v":"Ventas producto bebidas tienda Pontevedra 4"}]
[{"$f":"\"70000\"&Familias!$A$5&Tiendas!A16","v":"7000011351"},{"$f":"\"Ventas producto bebidas tienda\"&\" \"&Tiendas!B16","v":"Ventas producto bebidas tienda Madrid 1"}]
[{"$f":"\"70000\"&Familias!$A$5&Tiendas!A17","v":"7000011352"},{"$f":"\"Ventas producto bebidas tienda\"&\" \"&Tiendas!B17","v":"Ventas producto bebidas tienda Madrid 2"}]
[{"$f":"\"70000\"&Familias!$A$5&Tiendas!A18","v":"7000011353"},{"$f":"\"Ventas producto bebidas tienda\"&\" \"&Tiendas!B18","v":"Ventas producto bebidas tienda Madrid 3"}]
[{"$f":"\"70000\"&Familias!$A$5&Tiendas!A19","v":"7000011354"},{"$f":"\"Ventas producto bebidas tienda\"&\" \"&Tiendas!B19","v":"Ventas producto bebidas tienda Madrid 4"}]
[{"$f":"\"70000\"&Familias!$A$5&Tiendas!A20","v":"7000011355"},{"$f":"\"Ventas producto bebidas tienda\"&\" \"&Tiendas!B20","v":"Ventas producto bebidas tienda Madrid 5"}]
[{"$f":"\"70000\"&Familias!$A$5&Tiendas!A21","v":"7000011361"},{"$f":"\"Ventas producto bebidas tienda\"&\" \"&Tiendas!B21","v":"Ventas producto bebidas tienda Barcelona 1"}]
[{"$f":"\"70000\"&Familias!$A$5&Tiendas!A22","v":"7000011362"},{"$f":"\"Ventas producto bebidas tienda\"&\" \"&Tiendas!B22","v":"Ventas producto bebidas tienda Barcelona 2"}]
[{"$f":"\"70000\"&Familias!$A$5&Tiendas!A23","v":"7000011363"},{"$f":"\"Ventas producto bebidas tienda\"&\" \"&Tiendas!B23","v":"Ventas producto bebidas tienda Barcelona 3"}]
[{"$f":"\"70000\"&Familias!$A$5&Tiendas!A24","v":"7000011364"},{"$f":"\"Ventas producto bebidas tienda\"&\" \"&Tiendas!B24","v":"Ventas producto bebidas tienda Barcelona 4"}]
[{"$f":"\"70000\"&Familias!$A$5&Tiendas!A25","v":"7000011371"},{"$f":"\"Ventas producto bebidas tienda\"&\" \"&Tiendas!B25","v":"Ventas producto bebidas tienda Bilbao 1"}]
[{"$f":"\"70000\"&Familias!$A$5&Tiendas!A26","v":"7000011372"},{"$f":"\"Ventas producto bebidas tienda\"&\" \"&Tiendas!B26","v":"Ventas producto bebidas tienda Bilbao 2"}]
[{"$f":"\"70000\"&Familias!$A$5&Tiendas!A27","v":"7000011380"},{"$f":"\"Ventas producto bebidas tienda\"&\" \"&Tiendas!B27","v":"Ventas producto bebidas tienda Almacén"}]
[70000121,"Ventas producto cerámicas"]
[{"$f":"\"70000\"&Familias!$A$6&Tiendas!A2","v":"7000012111"},{"$f":"\"Ventas producto cerámicas tienda\"&\" \"&Tiendas!B2","v":"Ventas producto cerámicas tienda A Coruña 1"}]
[{"$f":"\"70000\"&Familias!$A$6&Tiendas!A3","v":"7000012112"},{"$f":"\"Ventas producto cerámicas tienda\"&\" \"&Tiendas!B3","v":"Ventas producto cerámicas tienda A Coruña 2"}]
[{"$f":"\"70000\"&Familias!$A$6&Tiendas!A4","v":"7000012113"},{"$f":"\"Ventas producto cerámicas tienda\"&\" \"&Tiendas!B4","v":"Ventas producto cerámicas tienda A Coruña 3"}]
[{"$f":"\"70000\"&Familias!$A$6&Tiendas!A5","v":"7000012114"},{"$f":"\"Ventas producto cerámicas tienda\"&\" \"&Tiendas!B5","v":"Ventas producto cerámicas tienda A Coruña 4"}]
[{"$f":"\"70000\"&Familias!$A$6&Tiendas!A6","v":"7000012115"},{"$f":"\"Ventas producto cerámicas tienda\"&\" \"&Tiendas!B6","v":"Ventas producto cerámicas tienda A Coruña 5"}]
[{"$f":"\"70000\"&Familias!$A$6&Tiendas!A7","v":"7000012121"},{"$f":"\"Ventas producto cerámicas tienda\"&\" \"&Tiendas!B7","v":"Ventas producto cerámicas tienda Lugo 1"}]
[{"$f":"\"70000\"&Familias!$A$6&Tiendas!A8","v":"7000012122"},{"$f":"\"Ventas producto cerámicas tienda\"&\" \"&Tiendas!B8","v":"Ventas producto cerámicas tienda Lugo 2"}]
[{"$f":"\"70000\"&Familias!$A$6&Tiendas!A9","v":"7000012131"},{"$f":"\"Ventas producto cerámicas tienda\"&\" \"&Tiendas!B9","v":"Ventas producto cerámicas tienda Ourense 1"}]
[{"$f":"\"70000\"&Familias!$A$6&Tiendas!A10","v":"7000012132"},{"$f":"\"Ventas producto cerámicas tienda\"&\" \"&Tiendas!B10","v":"Ventas producto cerámicas tienda Ourense 2"}]
[{"$f":"\"70000\"&Familias!$A$6&Tiendas!A11","v":"7000012133"},{"$f":"\"Ventas producto cerámicas tienda\"&\" \"&Tiendas!B11","v":"Ventas producto cerámicas tienda Ourense 3"}]
[{"$f":"\"70000\"&Familias!$A$6&Tiendas!A12","v":"7000012141"},{"$f":"\"Ventas producto cerámicas tienda\"&\" \"&Tiendas!B12","v":"Ventas producto cerámicas tienda Pontevedra 1"}]
[{"$f":"\"70000\"&Familias!$A$6&Tiendas!A13","v":"7000012142"},{"$f":"\"Ventas producto cerámicas tienda\"&\" \"&Tiendas!B13","v":"Ventas producto cerámicas tienda Pontevedra 2"}]
[{"$f":"\"70000\"&Familias!$A$6&Tiendas!A14","v":"7000012143"},{"$f":"\"Ventas producto cerámicas tienda\"&\" \"&Tiendas!B14","v":"Ventas producto cerámicas tienda Pontevedra 3"}]
[{"$f":"\"70000\"&Familias!$A$6&Tiendas!A15","v":"7000012144"},{"$f":"\"Ventas producto cerámicas tienda\"&\" \"&Tiendas!B15","v":"Ventas producto cerámicas tienda Pontevedra 4"}]
[{"$f":"\"70000\"&Familias!$A$6&Tiendas!A16","v":"7000012151"},{"$f":"\"Ventas producto cerámicas tienda\"&\" \"&Tiendas!B16","v":"Ventas producto cerámicas tienda Madrid 1"}]
[{"$f":"\"70000\"&Familias!$A$6&Tiendas!A17","v":"7000012152"},{"$f":"\"Ventas producto cerámicas tienda\"&\" \"&Tiendas!B17","v":"Ventas producto cerámicas tienda Madrid 2"}]
[{"$f":"\"70000\"&Familias!$A$6&Tiendas!A18","v":"7000012153"},{"$f":"\"Ventas producto cerámicas tienda\"&\" \"&Tiendas!B18","v":"Ventas producto cerámicas tienda Madrid 3"}]
[{"$f":"\"70000\"&Familias!$A$6&Tiendas!A19","v":"7000012154"},{"$f":"\"Ventas producto cerámicas tienda\"&\" \"&Tiendas!B19","v":"Ventas producto cerámicas tienda Madrid 4"}]
[{"$f":"\"70000\"&Familias!$A$6&Tiendas!A20","v":"7000012155"},{"$f":"\"Ventas producto cerámicas tienda\"&\" \"&Tiendas!B20","v":"Ventas producto cerámicas tienda Madrid 5"}]
[{"$f":"\"70000\"&Familias!$A$6&Tiendas!A21","v":"7000012161"},{"$f":"\"Ventas producto cerámicas tienda\"&\" \"&Tiendas!B21","v":"Ventas producto cerámicas tienda Barcelona 1"}]
[{"$f":"\"70000\"&Familias!$A$6&Tiendas!A22","v":"7000012162"},{"$f":"\"Ventas producto cerámicas tienda\"&\" \"&Tiendas!B22","v":"Ventas producto cerámicas tienda Barcelona 2"}]
[{"$f":"\"70000\"&Familias!$A$6&Tiendas!A23","v":"7000012163"},{"$f":"\"Ventas producto cerámicas tienda\"&\" \"&Tiendas!B23","v":"Ventas producto cerámicas tienda Barcelona 3"}]
[{"$f":"\"70000\"&Familias!$A$6&Tiendas!A24","v":"7000012164"},{"$f":"\"Ventas producto cerámicas tienda\"&\" \"&Tiendas!B24","v":"Ventas producto cerámicas tienda Barcelona 4"}]
[{"$f":"\"70000\"&Familias!$A$6&Tiendas!A25","v":"7000012171"},{"$f":"\"Ventas producto cerámicas tienda\"&\" \"&Tiendas!B25","v":"Ventas producto cerámicas tienda Bilbao 1"}]
[{"$f":"\"70000\"&Familias!$A$6&Tiendas!A26","v":"7000012172"},{"$f":"\"Ventas producto cerámicas tienda\"&\" \"&Tiendas!B26","v":"Ventas producto cerámicas tienda Bilbao 2"}]
[{"$f":"\"70000\"&Familias!$A$6&Tiendas!A27","v":"7000012180"},{"$f":"\"Ventas producto cerámicas tienda\"&\" \"&Tiendas!B27","v":"Ventas producto cerámicas tienda Almacén"}]
[70000122,"Ventas producro encaje"]
[{"$f":"\"70000\"&Familias!$A$7&Tiendas!A2","v":"7000012211"},{"$f":"\"Ventas producto encaje tienda\"&\" \"&Tiendas!B2","v":"Ventas producto encaje tienda A Coruña 1"}]
[{"$f":"\"70000\"&Familias!$A$7&Tiendas!A3","v":"7000012212"},{"$f":"\"Ventas producto encaje tienda\"&\" \"&Tiendas!B3","v":"Ventas producto encaje tienda A Coruña 2"}]
[{"$f":"\"70000\"&Familias!$A$7&Tiendas!A4","v":"7000012213"},{"$f":"\"Ventas producto encaje tienda\"&\" \"&Tiendas!B4","v":"Ventas producto encaje tienda A Coruña 3"}]
[{"$f":"\"70000\"&Familias!$A$7&Tiendas!A5","v":"7000012214"},{"$f":"\"Ventas producto encaje tienda\"&\" \"&Tiendas!B5","v":"Ventas producto encaje tienda A Coruña 4"}]
[{"$f":"\"70000\"&Familias!$A$7&Tiendas!A6","v":"7000012215"},{"$f":"\"Ventas producto encaje tienda\"&\" \"&Tiendas!B6","v":"Ventas producto encaje tienda A Coruña 5"}]
[{"$f":"\"70000\"&Familias!$A$7&Tiendas!A7","v":"7000012221"},{"$f":"\"Ventas producto encaje tienda\"&\" \"&Tiendas!B7","v":"Ventas producto encaje tienda Lugo 1"}]
[{"$f":"\"70000\"&Familias!$A$7&Tiendas!A8","v":"7000012222"},{"$f":"\"Ventas producto encaje tienda\"&\" \"&Tiendas!B8","v":"Ventas producto encaje tienda Lugo 2"}]
[{"$f":"\"70000\"&Familias!$A$7&Tiendas!A9","v":"7000012231"},{"$f":"\"Ventas producto encaje tienda\"&\" \"&Tiendas!B9","v":"Ventas producto encaje tienda Ourense 1"}]
[{"$f":"\"70000\"&Familias!$A$7&Tiendas!A10","v":"7000012232"},{"$f":"\"Ventas producto encaje tienda\"&\" \"&Tiendas!B10","v":"Ventas producto encaje tienda Ourense 2"}]
[{"$f":"\"70000\"&Familias!$A$7&Tiendas!A11","v":"7000012233"},{"$f":"\"Ventas producto encaje tienda\"&\" \"&Tiendas!B11","v":"Ventas producto encaje tienda Ourense 3"}]
[{"$f":"\"70000\"&Familias!$A$7&Tiendas!A12","v":"7000012241"},{"$f":"\"Ventas producto encaje tienda\"&\" \"&Tiendas!B12","v":"Ventas producto encaje tienda Pontevedra 1"}]
[{"$f":"\"70000\"&Familias!$A$7&Tiendas!A13","v":"7000012242"},{"$f":"\"Ventas producto encaje tienda\"&\" \"&Tiendas!B13","v":"Ventas producto encaje tienda Pontevedra 2"}]
[{"$f":"\"70000\"&Familias!$A$7&Tiendas!A14","v":"7000012243"},{"$f":"\"Ventas producto encaje tienda\"&\" \"&Tiendas!B14","v":"Ventas producto encaje tienda Pontevedra 3"}]
[{"$f":"\"70000\"&Familias!$A$7&Tiendas!A15","v":"7000012244"},{"$f":"\"Ventas producto encaje tienda\"&\" \"&Tiendas!B15","v":"Ventas producto encaje tienda Pontevedra 4"}]
[{"$f":"\"70000\"&Familias!$A$7&Tiendas!A16","v":"7000012251"},{"$f":"\"Ventas producto encaje tienda\"&\" \"&Tiendas!B16","v":"Ventas producto encaje tienda Madrid 1"}]
[{"$f":"\"70000\"&Familias!$A$7&Tiendas!A17","v":"7000012252"},{"$f":"\"Ventas producto encaje tienda\"&\" \"&Tiendas!B17","v":"Ventas producto encaje tienda Madrid 2"}]
[{"$f":"\"70000\"&Familias!$A$7&Tiendas!A18","v":"7000012253"},{"$f":"\"Ventas producto encaje tienda\"&\" \"&Tiendas!B18","v":"Ventas producto encaje tienda Madrid 3"}]
[{"$f":"\"70000\"&Familias!$A$7&Tiendas!A19","v":"7000012254"},{"$f":"\"Ventas producto encaje tienda\"&\" \"&Tiendas!B19","v":"Ventas producto encaje tienda Madrid 4"}]
[{"$f":"\"70000\"&Familias!$A$7&Tiendas!A20","v":"7000012255"},{"$f":"\"Ventas producto encaje tienda\"&\" \"&Tiendas!B20","v":"Ventas producto encaje tienda Madrid 5"}]
[{"$f":"\"70000\"&Familias!$A$7&Tiendas!A21","v":"7000012261"},{"$f":"\"Ventas producto encaje tienda\"&\" \"&Tiendas!B21","v":"Ventas producto encaje tienda Barcelona 1"}]
[{"$f":"\"70000\"&Familias!$A$7&Tiendas!A22","v":"7000012262"},{"$f":"\"Ventas producto encaje tienda\"&\" \"&Tiendas!B22","v":"Ventas producto encaje tienda Barcelona 2"}]
[{"$f":"\"70000\"&Familias!$A$7&Tiendas!A23","v":"7000012263"},{"$f":"\"Ventas producto encaje tienda\"&\" \"&Tiendas!B23","v":"Ventas producto encaje tienda Barcelona 3"}]
[{"$f":"\"70000\"&Familias!$A$7&Tiendas!A24","v":"7000012264"},{"$f":"\"Ventas producto encaje tienda\"&\" \"&Tiendas!B24","v":"Ventas producto encaje tienda Barcelona 4"}]
[{"$f":"\"70000\"&Familias!$A$7&Tiendas!A25","v":"7000012271"},{"$f":"\"Ventas producto encaje tienda\"&\" \"&Tiendas!B25","v":"Ventas producto encaje tienda Bilbao 1"}]
[{"$f":"\"70000\"&Familias!$A$7&Tiendas!A26","v":"7000012272"},{"$f":"\"Ventas producto encaje tienda\"&\" \"&Tiendas!B26","v":"Ventas producto encaje tienda Bilbao 2"}]
[{"$f":"\"70000\"&Familias!$A$7&Tiendas!A27","v":"7000012280"},{"$f":"\"Ventas producto encaje tienda\"&\" \"&Tiendas!B27","v":"Ventas producto encaje tienda Almacén"}]
[70000123,"Ventas producto cuero"]
[{"$f":"\"70000\"&Familias!$A$8&Tiendas!A2","v":"7000012311"},{"$f":"\"Ventas producto cuero tienda\"&\" \"&Tiendas!B2","v":"Ventas producto cuero tienda A Coruña 1"}]
[{"$f":"\"70000\"&Familias!$A$8&Tiendas!A3","v":"7000012312"},{"$f":"\"Ventas producto cuero tienda\"&\" \"&Tiendas!B3","v":"Ventas producto cuero tienda A Coruña 2"}]
[{"$f":"\"70000\"&Familias!$A$8&Tiendas!A4","v":"7000012313"},{"$f":"\"Ventas producto cuero tienda\"&\" \"&Tiendas!B4","v":"Ventas producto cuero tienda A Coruña 3"}]
[{"$f":"\"70000\"&Familias!$A$8&Tiendas!A5","v":"7000012314"},{"$f":"\"Ventas producto cuero tienda\"&\" \"&Tiendas!B5","v":"Ventas producto cuero tienda A Coruña 4"}]
[{"$f":"\"70000\"&Familias!$A$8&Tiendas!A6","v":"7000012315"},{"$f":"\"Ventas producto cuero tienda\"&\" \"&Tiendas!B6","v":"Ventas producto cuero tienda A Coruña 5"}]
[{"$f":"\"70000\"&Familias!$A$8&Tiendas!A7","v":"7000012321"},{"$f":"\"Ventas producto cuero tienda\"&\" \"&Tiendas!B7","v":"Ventas producto cuero tienda Lugo 1"}]
[{"$f":"\"70000\"&Familias!$A$8&Tiendas!A8","v":"7000012322"},{"$f":"\"Ventas producto cuero tienda\"&\" \"&Tiendas!B8","v":"Ventas producto cuero tienda Lugo 2"}]
[{"$f":"\"70000\"&Familias!$A$8&Tiendas!A9","v":"7000012331"},{"$f":"\"Ventas producto cuero tienda\"&\" \"&Tiendas!B9","v":"Ventas producto cuero tienda Ourense 1"}]
[{"$f":"\"70000\"&Familias!$A$8&Tiendas!A10","v":"7000012332"},{"$f":"\"Ventas producto cuero tienda\"&\" \"&Tiendas!B10","v":"Ventas producto cuero tienda Ourense 2"}]
[{"$f":"\"70000\"&Familias!$A$8&Tiendas!A11","v":"7000012333"},{"$f":"\"Ventas producto cuero tienda\"&\" \"&Tiendas!B11","v":"Ventas producto cuero tienda Ourense 3"}]
[{"$f":"\"70000\"&Familias!$A$8&Tiendas!A12","v":"7000012341"},{"$f":"\"Ventas producto cuero tienda\"&\" \"&Tiendas!B12","v":"Ventas producto cuero tienda Pontevedra 1"}]
[{"$f":"\"70000\"&Familias!$A$8&Tiendas!A13","v":"7000012342"},{"$f":"\"Ventas producto cuero tienda\"&\" \"&Tiendas!B13","v":"Ventas producto cuero tienda Pontevedra 2"}]
[{"$f":"\"70000\"&Familias!$A$8&Tiendas!A14","v":"7000012343"},{"$f":"\"Ventas producto cuero tienda\"&\" \"&Tiendas!B14","v":"Ventas producto cuero tienda Pontevedra 3"}]
[{"$f":"\"70000\"&Familias!$A$8&Tiendas!A15","v":"7000012344"},{"$f":"\"Ventas producto cuero tienda\"&\" \"&Tiendas!B15","v":"Ventas producto cuero tienda Pontevedra 4"}]
[{"$f":"\"70000\"&Familias!$A$8&Tiendas!A16","v":"7000012351"},{"$f":"\"Ventas producto cuero tienda\"&\" \"&Tiendas!B16","v":"Ventas producto cuero tienda Madrid 1"}]
[{"$f":"\"70000\"&Familias!$A$8&Tiendas!A17","v":"7000012352"},{"$f":"\"Ventas producto cuero tienda\"&\" \"&Tiendas!B17","v":"Ventas producto cuero tienda Madrid 2"}]
[{"$f":"\"70000\"&Familias!$A$8&Tiendas!A18","v":"7000012353"},{"$f":"\"Ventas producto cuero tienda\"&\" \"&Tiendas!B18","v":"Ventas producto cuero tienda Madrid 3"}]
[{"$f":"\"70000\"&Familias!$A$8&Tiendas!A19","v":"7000012354"},{"$f":"\"Ventas producto cuero tienda\"&\" \"&Tiendas!B19","v":"Ventas producto cuero tienda Madrid 4"}]
[{"$f":"\"70000\"&Familias!$A$8&Tiendas!A20","v":"7000012355"},{"$f":"\"Ventas producto cuero tienda\"&\" \"&Tiendas!B20","v":"Ventas producto cuero tienda Madrid 5"}]
[{"$f":"\"70000\"&Familias!$A$8&Tiendas!A21","v":"7000012361"},{"$f":"\"Ventas producto cuero tienda\"&\" \"&Tiendas!B21","v":"Ventas producto cuero tienda Barcelona 1"}]
[{"$f":"\"70000\"&Familias!$A$8&Tiendas!A22","v":"7000012362"},{"$f":"\"Ventas producto cuero tienda\"&\" \"&Tiendas!B22","v":"Ventas producto cuero tienda Barcelona 2"}]
[{"$f":"\"70000\"&Familias!$A$8&Tiendas!A23","v":"7000012363"},{"$f":"\"Ventas producto cuero tienda\"&\" \"&Tiendas!B23","v":"Ventas producto cuero tienda Barcelona 3"}]
[{"$f":"\"70000\"&Familias!$A$8&Tiendas!A24","v":"7000012364"},{"$f":"\"Ventas producto cuero tienda\"&\" \"&Tiendas!B24","v":"Ventas producto cuero tienda Barcelona 4"}]
[{"$f":"\"70000\"&Familias!$A$8&Tiendas!A25","v":"7000012371"},{"$f":"\"Ventas producto cuero tienda\"&\" \"&Tiendas!B25","v":"Ventas producto cuero tienda Bilbao 1"}]
[{"$f":"\"70000\"&Familias!$A$8&Tiendas!A26","v":"7000012372"},{"$f":"\"Ventas producto cuero tienda\"&\" \"&Tiendas!B26","v":"Ventas producto cuero tienda Bilbao 2"}]
[{"$f":"\"70000\"&Familias!$A$8&Tiendas!A27","v":"7000012380"},{"$f":"\"Ventas producto cuero tienda\"&\" \"&Tiendas!B27","v":"Ventas producto cuero tienda Almacén"}]
[701,"VENTAS DE PRODUCTOS TERMINADOS"]
[702,"VENTAS DE PRODUCTOS SEMITERMINADOS"]
[703,"VENTAS DE SUBPRODUCTOS Y RESIDUOS"]
[704,"VENTAS DE ENVASES Y EMBALAJES"]
[705,"PRESTACIONES DE SERVICIOS"]
[{"$f":"Franquicias!H2","v":"7050000091"},{"$f":"\"Ing. Royaltie Franquiciado \"&Franquicias!C2 &\" \"&Franquicias!B2","v":"Ing. Royaltie Franquiciado D Vimianzo SL"}]
[{"$f":"Franquicias!H3","v":"7050000092"},{"$f":"\"Ing. Royaltie Franquiciado \"&Franquicias!C3 &\" \"&Franquicias!B3","v":"Ing. Royaltie Franquiciado F Camariñas SL"}]
[{"$f":"Franquicias!H4","v":"7050000093"},{"$f":"\"Ing. Royaltie Franquiciado \"&Franquicias!C4 &\" \"&Franquicias!B4","v":"Ing. Royaltie Franquiciado F Muxía SL"}]
[{"$f":"Franquicias!H5","v":"7050000094"},{"$f":"\"Ing. Royaltie Franquiciado \"&Franquicias!C5 &\" \"&Franquicias!B5","v":"Ing. Royaltie Franquiciado D Costa da Morte SL"}]
[{"$f":"Franquicias!H6","v":"7050000095"},{"$f":"\"Ing. Royaltie Franquiciado \"&Franquicias!C6 &\" \"&Franquicias!B6","v":"Ing. Royaltie Franquiciado F Malpica SL"}]
[{"$f":"Franquicias!H7","v":"7050000096"},{"$f":"\"Ing. Royaltie Franquiciado \"&Franquicias!C7 &\" \"&Franquicias!B7","v":"Ing. Royaltie Franquiciado F Dumbría SL"}]
[706,"DESCUENTOS SOBRE VENTAS POR PRONTO PAGO"]
[7060,"DESCUENTOS SOBRE VENTAS POR PRONTO PAGO DE MERCADERÍAS"]
[70600111,"Descuento ventas por pronto pago producto Mar"]
[{"$f":"\"70600\"&Familias!$A$3&Tiendas!A2","v":"7060011111"},{"$f":"\"Descuento ventas por pronto pago producto Mar tienda\"&\" \"&Tiendas!B2","v":"Descuento ventas por pronto pago producto Mar tienda A Coruña 1"}]
[{"$f":"\"70600\"&Familias!$A$3&Tiendas!A3","v":"7060011112"},{"$f":"\"Descuento ventas por pronto pago producto Mar tienda\"&\" \"&Tiendas!B3","v":"Descuento ventas por pronto pago producto Mar tienda A Coruña 2"}]
[{"$f":"\"70600\"&Familias!$A$3&Tiendas!A4","v":"7060011113"},{"$f":"\"Descuento ventas por pronto pago producto Mar tienda\"&\" \"&Tiendas!B4","v":"Descuento ventas por pronto pago producto Mar tienda A Coruña 3"}]
[{"$f":"\"70600\"&Familias!$A$3&Tiendas!A5","v":"7060011114"},{"$f":"\"Descuento ventas por pronto pago producto Mar tienda\"&\" \"&Tiendas!B5","v":"Descuento ventas por pronto pago producto Mar tienda A Coruña 4"}]
[{"$f":"\"70600\"&Familias!$A$3&Tiendas!A6","v":"7060011115"},{"$f":"\"Descuento ventas por pronto pago producto Mar tienda\"&\" \"&Tiendas!B6","v":"Descuento ventas por pronto pago producto Mar tienda A Coruña 5"}]
[{"$f":"\"70600\"&Familias!$A$3&Tiendas!A7","v":"7060011121"},{"$f":"\"Descuento ventas por pronto pago producto Mar tienda\"&\" \"&Tiendas!B7","v":"Descuento ventas por pronto pago producto Mar tienda Lugo 1"}]
[{"$f":"\"70600\"&Familias!$A$3&Tiendas!A8","v":"7060011122"},{"$f":"\"Descuento ventas por pronto pago producto Mar tienda\"&\" \"&Tiendas!B8","v":"Descuento ventas por pronto pago producto Mar tienda Lugo 2"}]
[{"$f":"\"70600\"&Familias!$A$3&Tiendas!A9","v":"7060011131"},{"$f":"\"Descuento ventas por pronto pago producto Mar tienda\"&\" \"&Tiendas!B9","v":"Descuento ventas por pronto pago producto Mar tienda Ourense 1"}]
[{"$f":"\"70600\"&Familias!$A$3&Tiendas!A10","v":"7060011132"},{"$f":"\"Descuento ventas por pronto pago producto Mar tienda\"&\" \"&Tiendas!B10","v":"Descuento ventas por pronto pago producto Mar tienda Ourense 2"}]
[{"$f":"\"70600\"&Familias!$A$3&Tiendas!A11","v":"7060011133"},{"$f":"\"Descuento ventas por pronto pago producto Mar tienda\"&\" \"&Tiendas!B11","v":"Descuento ventas por pronto pago producto Mar tienda Ourense 3"}]
[{"$f":"\"70600\"&Familias!$A$3&Tiendas!A12","v":"7060011141"},{"$f":"\"Descuento ventas por pronto pago producto Mar tienda\"&\" \"&Tiendas!B12","v":"Descuento ventas por pronto pago producto Mar tienda Pontevedra 1"}]
[{"$f":"\"70600\"&Familias!$A$3&Tiendas!A13","v":"7060011142"},{"$f":"\"Descuento ventas por pronto pago producto Mar tienda\"&\" \"&Tiendas!B13","v":"Descuento ventas por pronto pago producto Mar tienda Pontevedra 2"}]
[{"$f":"\"70600\"&Familias!$A$3&Tiendas!A14","v":"7060011143"},{"$f":"\"Descuento ventas por pronto pago producto Mar tienda\"&\" \"&Tiendas!B14","v":"Descuento ventas por pronto pago producto Mar tienda Pontevedra 3"}]
[{"$f":"\"70600\"&Familias!$A$3&Tiendas!A15","v":"7060011144"},{"$f":"\"Descuento ventas por pronto pago producto Mar tienda\"&\" \"&Tiendas!B15","v":"Descuento ventas por pronto pago producto Mar tienda Pontevedra 4"}]
[{"$f":"\"70600\"&Familias!$A$3&Tiendas!A16","v":"7060011151"},{"$f":"\"Descuento ventas por pronto pago producto Mar tienda\"&\" \"&Tiendas!B16","v":"Descuento ventas por pronto pago producto Mar tienda Madrid 1"}]
[{"$f":"\"70600\"&Familias!$A$3&Tiendas!A17","v":"7060011152"},{"$f":"\"Descuento ventas por pronto pago producto Mar tienda\"&\" \"&Tiendas!B17","v":"Descuento ventas por pronto pago producto Mar tienda Madrid 2"}]
[{"$f":"\"70600\"&Familias!$A$3&Tiendas!A18","v":"7060011153"},{"$f":"\"Descuento ventas por pronto pago producto Mar tienda\"&\" \"&Tiendas!B18","v":"Descuento ventas por pronto pago producto Mar tienda Madrid 3"}]
[{"$f":"\"70600\"&Familias!$A$3&Tiendas!A19","v":"7060011154"},{"$f":"\"Descuento ventas por pronto pago producto Mar tienda\"&\" \"&Tiendas!B19","v":"Descuento ventas por pronto pago producto Mar tienda Madrid 4"}]
[{"$f":"\"70600\"&Familias!$A$3&Tiendas!A20","v":"7060011155"},{"$f":"\"Descuento ventas por pronto pago producto Mar tienda\"&\" \"&Tiendas!B20","v":"Descuento ventas por pronto pago producto Mar tienda Madrid 5"}]
[{"$f":"\"70600\"&Familias!$A$3&Tiendas!A21","v":"7060011161"},{"$f":"\"Descuento ventas por pronto pago producto Mar tienda\"&\" \"&Tiendas!B21","v":"Descuento ventas por pronto pago producto Mar tienda Barcelona 1"}]
[{"$f":"\"70600\"&Familias!$A$3&Tiendas!A22","v":"7060011162"},{"$f":"\"Descuento ventas por pronto pago producto Mar tienda\"&\" \"&Tiendas!B22","v":"Descuento ventas por pronto pago producto Mar tienda Barcelona 2"}]
[{"$f":"\"70600\"&Familias!$A$3&Tiendas!A23","v":"7060011163"},{"$f":"\"Descuento ventas por pronto pago producto Mar tienda\"&\" \"&Tiendas!B23","v":"Descuento ventas por pronto pago producto Mar tienda Barcelona 3"}]
[{"$f":"\"70600\"&Familias!$A$3&Tiendas!A24","v":"7060011164"},{"$f":"\"Descuento ventas por pronto pago producto Mar tienda\"&\" \"&Tiendas!B24","v":"Descuento ventas por pronto pago producto Mar tienda Barcelona 4"}]
[{"$f":"\"70600\"&Familias!$A$3&Tiendas!A25","v":"7060011171"},{"$f":"\"Descuento ventas por pronto pago producto Mar tienda\"&\" \"&Tiendas!B25","v":"Descuento ventas por pronto pago producto Mar tienda Bilbao 1"}]
[{"$f":"\"70600\"&Familias!$A$3&Tiendas!A26","v":"7060011172"},{"$f":"\"Descuento ventas por pronto pago producto Mar tienda\"&\" \"&Tiendas!B26","v":"Descuento ventas por pronto pago producto Mar tienda Bilbao 2"}]
[{"$f":"\"70600\"&Familias!$A$3&Tiendas!A27","v":"7060011180"},{"$f":"\"Descuento ventas por pronto pago producto Mar tienda\"&\" \"&Tiendas!B27","v":"Descuento ventas por pronto pago producto Mar tienda Almacén"}]
[70600112,"Descuento ventas por pronto pago producto Campo"]
[{"$f":"\"70600\"&Familias!$A$4&Tiendas!A2","v":"7060011211"},{"$f":"\"Descuento ventas por pronto pago producto Campo tienda\"&\" \"&Tiendas!B2","v":"Descuento ventas por pronto pago producto Campo tienda A Coruña 1"}]
[{"$f":"\"70600\"&Familias!$A$4&Tiendas!A3","v":"7060011212"},{"$f":"\"Descuento ventas por pronto pago producto Campo tienda\"&\" \"&Tiendas!B3","v":"Descuento ventas por pronto pago producto Campo tienda A Coruña 2"}]
[{"$f":"\"70600\"&Familias!$A$4&Tiendas!A4","v":"7060011213"},{"$f":"\"Descuento ventas por pronto pago producto Campo tienda\"&\" \"&Tiendas!B4","v":"Descuento ventas por pronto pago producto Campo tienda A Coruña 3"}]
[{"$f":"\"70600\"&Familias!$A$4&Tiendas!A5","v":"7060011214"},{"$f":"\"Descuento ventas por pronto pago producto Campo tienda\"&\" \"&Tiendas!B5","v":"Descuento ventas por pronto pago producto Campo tienda A Coruña 4"}]
[{"$f":"\"70600\"&Familias!$A$4&Tiendas!A6","v":"7060011215"},{"$f":"\"Descuento ventas por pronto pago producto Campo tienda\"&\" \"&Tiendas!B6","v":"Descuento ventas por pronto pago producto Campo tienda A Coruña 5"}]
[{"$f":"\"70600\"&Familias!$A$4&Tiendas!A7","v":"7060011221"},{"$f":"\"Descuento ventas por pronto pago producto Campo tienda\"&\" \"&Tiendas!B7","v":"Descuento ventas por pronto pago producto Campo tienda Lugo 1"}]
[{"$f":"\"70600\"&Familias!$A$4&Tiendas!A8","v":"7060011222"},{"$f":"\"Descuento ventas por pronto pago producto Campo tienda\"&\" \"&Tiendas!B8","v":"Descuento ventas por pronto pago producto Campo tienda Lugo 2"}]
[{"$f":"\"70600\"&Familias!$A$4&Tiendas!A9","v":"7060011231"},{"$f":"\"Descuento ventas por pronto pago producto Campo tienda\"&\" \"&Tiendas!B9","v":"Descuento ventas por pronto pago producto Campo tienda Ourense 1"}]
[{"$f":"\"70600\"&Familias!$A$4&Tiendas!A10","v":"7060011232"},{"$f":"\"Descuento ventas por pronto pago producto Campo tienda\"&\" \"&Tiendas!B10","v":"Descuento ventas por pronto pago producto Campo tienda Ourense 2"}]
[{"$f":"\"70600\"&Familias!$A$4&Tiendas!A11","v":"7060011233"},{"$f":"\"Descuento ventas por pronto pago producto Campo tienda\"&\" \"&Tiendas!B11","v":"Descuento ventas por pronto pago producto Campo tienda Ourense 3"}]
[{"$f":"\"70600\"&Familias!$A$4&Tiendas!A12","v":"7060011241"},{"$f":"\"Descuento ventas por pronto pago producto Campo tienda\"&\" \"&Tiendas!B12","v":"Descuento ventas por pronto pago producto Campo tienda Pontevedra 1"}]
[{"$f":"\"70600\"&Familias!$A$4&Tiendas!A13","v":"7060011242"},{"$f":"\"Descuento ventas por pronto pago producto Campo tienda\"&\" \"&Tiendas!B13","v":"Descuento ventas por pronto pago producto Campo tienda Pontevedra 2"}]
[{"$f":"\"70600\"&Familias!$A$4&Tiendas!A14","v":"7060011243"},{"$f":"\"Descuento ventas por pronto pago producto Campo tienda\"&\" \"&Tiendas!B14","v":"Descuento ventas por pronto pago producto Campo tienda Pontevedra 3"}]
[{"$f":"\"70600\"&Familias!$A$4&Tiendas!A15","v":"7060011244"},{"$f":"\"Descuento ventas por pronto pago producto Campo tienda\"&\" \"&Tiendas!B15","v":"Descuento ventas por pronto pago producto Campo tienda Pontevedra 4"}]
[{"$f":"\"70600\"&Familias!$A$4&Tiendas!A16","v":"7060011251"},{"$f":"\"Descuento ventas por pronto pago producto Campo tienda\"&\" \"&Tiendas!B16","v":"Descuento ventas por pronto pago producto Campo tienda Madrid 1"}]
[{"$f":"\"70600\"&Familias!$A$4&Tiendas!A17","v":"7060011252"},{"$f":"\"Descuento ventas por pronto pago producto Campo tienda\"&\" \"&Tiendas!B17","v":"Descuento ventas por pronto pago producto Campo tienda Madrid 2"}]
[{"$f":"\"70600\"&Familias!$A$4&Tiendas!A18","v":"7060011253"},{"$f":"\"Descuento ventas por pronto pago producto Campo tienda\"&\" \"&Tiendas!B18","v":"Descuento ventas por pronto pago producto Campo tienda Madrid 3"}]
[{"$f":"\"70600\"&Familias!$A$4&Tiendas!A19","v":"7060011254"},{"$f":"\"Descuento ventas por pronto pago producto Campo tienda\"&\" \"&Tiendas!B19","v":"Descuento ventas por pronto pago producto Campo tienda Madrid 4"}]
[{"$f":"\"70600\"&Familias!$A$4&Tiendas!A20","v":"7060011255"},{"$f":"\"Descuento ventas por pronto pago producto Campo tienda\"&\" \"&Tiendas!B20","v":"Descuento ventas por pronto pago producto Campo tienda Madrid 5"}]
[{"$f":"\"70600\"&Familias!$A$4&Tiendas!A21","v":"7060011261"},{"$f":"\"Descuento ventas por pronto pago producto Campo tienda\"&\" \"&Tiendas!B21","v":"Descuento ventas por pronto pago producto Campo tienda Barcelona 1"}]
[{"$f":"\"70600\"&Familias!$A$4&Tiendas!A22","v":"7060011262"},{"$f":"\"Descuento ventas por pronto pago producto Campo tienda\"&\" \"&Tiendas!B22","v":"Descuento ventas por pronto pago producto Campo tienda Barcelona 2"}]
[{"$f":"\"70600\"&Familias!$A$4&Tiendas!A23","v":"7060011263"},{"$f":"\"Descuento ventas por pronto pago producto Campo tienda\"&\" \"&Tiendas!B23","v":"Descuento ventas por pronto pago producto Campo tienda Barcelona 3"}]
[{"$f":"\"70600\"&Familias!$A$4&Tiendas!A24","v":"7060011264"},{"$f":"\"Descuento ventas por pronto pago producto Campo tienda\"&\" \"&Tiendas!B24","v":"Descuento ventas por pronto pago producto Campo tienda Barcelona 4"}]
[{"$f":"\"70600\"&Familias!$A$4&Tiendas!A25","v":"7060011271"},{"$f":"\"Descuento ventas por pronto pago producto Campo tienda\"&\" \"&Tiendas!B25","v":"Descuento ventas por pronto pago producto Campo tienda Bilbao 1"}]
[{"$f":"\"70600\"&Familias!$A$4&Tiendas!A26","v":"7060011272"},{"$f":"\"Descuento ventas por pronto pago producto Campo tienda\"&\" \"&Tiendas!B26","v":"Descuento ventas por pronto pago producto Campo tienda Bilbao 2"}]
[{"$f":"\"70600\"&Familias!$A$4&Tiendas!A27","v":"7060011280"},{"$f":"\"Descuento ventas por pronto pago producto Campo tienda\"&\" \"&Tiendas!B27","v":"Descuento ventas por pronto pago producto Campo tienda Almacén"}]
[70600113,"Descuento ventas por pronto pago producto Bebidas"]
[{"$f":"\"70600\"&Familias!$A$5&Tiendas!A2","v":"7060011311"},{"$f":"\"Descuento ventas por pronto pago producto Bebidas tienda\"&\" \"&Tiendas!B2","v":"Descuento ventas por pronto pago producto Bebidas tienda A Coruña 1"}]
[{"$f":"\"70600\"&Familias!$A$5&Tiendas!A3","v":"7060011312"},{"$f":"\"Descuento ventas por pronto pago producto Bebidas tienda\"&\" \"&Tiendas!B3","v":"Descuento ventas por pronto pago producto Bebidas tienda A Coruña 2"}]
[{"$f":"\"70600\"&Familias!$A$5&Tiendas!A4","v":"7060011313"},{"$f":"\"Descuento ventas por pronto pago producto Bebidas tienda\"&\" \"&Tiendas!B4","v":"Descuento ventas por pronto pago producto Bebidas tienda A Coruña 3"}]
[{"$f":"\"70600\"&Familias!$A$5&Tiendas!A5","v":"7060011314"},{"$f":"\"Descuento ventas por pronto pago producto Bebidas tienda\"&\" \"&Tiendas!B5","v":"Descuento ventas por pronto pago producto Bebidas tienda A Coruña 4"}]
[{"$f":"\"70600\"&Familias!$A$5&Tiendas!A6","v":"7060011315"},{"$f":"\"Descuento ventas por pronto pago producto Bebidas tienda\"&\" \"&Tiendas!B6","v":"Descuento ventas por pronto pago producto Bebidas tienda A Coruña 5"}]
[{"$f":"\"70600\"&Familias!$A$5&Tiendas!A7","v":"7060011321"},{"$f":"\"Descuento ventas por pronto pago producto Bebidas tienda\"&\" \"&Tiendas!B7","v":"Descuento ventas por pronto pago producto Bebidas tienda Lugo 1"}]
[{"$f":"\"70600\"&Familias!$A$5&Tiendas!A8","v":"7060011322"},{"$f":"\"Descuento ventas por pronto pago producto Bebidas tienda\"&\" \"&Tiendas!B8","v":"Descuento ventas por pronto pago producto Bebidas tienda Lugo 2"}]
[{"$f":"\"70600\"&Familias!$A$5&Tiendas!A9","v":"7060011331"},{"$f":"\"Descuento ventas por pronto pago producto Bebidas tienda\"&\" \"&Tiendas!B9","v":"Descuento ventas por pronto pago producto Bebidas tienda Ourense 1"}]
[{"$f":"\"70600\"&Familias!$A$5&Tiendas!A10","v":"7060011332"},{"$f":"\"Descuento ventas por pronto pago producto Bebidas tienda\"&\" \"&Tiendas!B10","v":"Descuento ventas por pronto pago producto Bebidas tienda Ourense 2"}]
[{"$f":"\"70600\"&Familias!$A$5&Tiendas!A11","v":"7060011333"},{"$f":"\"Descuento ventas por pronto pago producto Bebidas tienda\"&\" \"&Tiendas!B11","v":"Descuento ventas por pronto pago producto Bebidas tienda Ourense 3"}]
[{"$f":"\"70600\"&Familias!$A$5&Tiendas!A12","v":"7060011341"},{"$f":"\"Descuento ventas por pronto pago producto Bebidas tienda\"&\" \"&Tiendas!B12","v":"Descuento ventas por pronto pago producto Bebidas tienda Pontevedra 1"}]
[{"$f":"\"70600\"&Familias!$A$5&Tiendas!A13","v":"7060011342"},{"$f":"\"Descuento ventas por pronto pago producto Bebidas tienda\"&\" \"&Tiendas!B13","v":"Descuento ventas por pronto pago producto Bebidas tienda Pontevedra 2"}]
[{"$f":"\"70600\"&Familias!$A$5&Tiendas!A14","v":"7060011343"},{"$f":"\"Descuento ventas por pronto pago producto Bebidas tienda\"&\" \"&Tiendas!B14","v":"Descuento ventas por pronto pago producto Bebidas tienda Pontevedra 3"}]
[{"$f":"\"70600\"&Familias!$A$5&Tiendas!A15","v":"7060011344"},{"$f":"\"Descuento ventas por pronto pago producto Bebidas tienda\"&\" \"&Tiendas!B15","v":"Descuento ventas por pronto pago producto Bebidas tienda Pontevedra 4"}]
[{"$f":"\"70600\"&Familias!$A$5&Tiendas!A16","v":"7060011351"},{"$f":"\"Descuento ventas por pronto pago producto Bebidas tienda\"&\" \"&Tiendas!B16","v":"Descuento ventas por pronto pago producto Bebidas tienda Madrid 1"}]
[{"$f":"\"70600\"&Familias!$A$5&Tiendas!A17","v":"7060011352"},{"$f":"\"Descuento ventas por pronto pago producto Bebidas tienda\"&\" \"&Tiendas!B17","v":"Descuento ventas por pronto pago producto Bebidas tienda Madrid 2"}]
[{"$f":"\"70600\"&Familias!$A$5&Tiendas!A18","v":"7060011353"},{"$f":"\"Descuento ventas por pronto pago producto Bebidas tienda\"&\" \"&Tiendas!B18","v":"Descuento ventas por pronto pago producto Bebidas tienda Madrid 3"}]
[{"$f":"\"70600\"&Familias!$A$5&Tiendas!A19","v":"7060011354"},{"$f":"\"Descuento ventas por pronto pago producto Bebidas tienda\"&\" \"&Tiendas!B19","v":"Descuento ventas por pronto pago producto Bebidas tienda Madrid 4"}]
[{"$f":"\"70600\"&Familias!$A$5&Tiendas!A20","v":"7060011355"},{"$f":"\"Descuento ventas por pronto pago producto Bebidas tienda\"&\" \"&Tiendas!B20","v":"Descuento ventas por pronto pago producto Bebidas tienda Madrid 5"}]
[{"$f":"\"70600\"&Familias!$A$5&Tiendas!A21","v":"7060011361"},{"$f":"\"Descuento ventas por pronto pago producto Bebidas tienda\"&\" \"&Tiendas!B21","v":"Descuento ventas por pronto pago producto Bebidas tienda Barcelona 1"}]
[{"$f":"\"70600\"&Familias!$A$5&Tiendas!A22","v":"7060011362"},{"$f":"\"Descuento ventas por pronto pago producto Bebidas tienda\"&\" \"&Tiendas!B22","v":"Descuento ventas por pronto pago producto Bebidas tienda Barcelona 2"}]
[{"$f":"\"70600\"&Familias!$A$5&Tiendas!A23","v":"7060011363"},{"$f":"\"Descuento ventas por pronto pago producto Bebidas tienda\"&\" \"&Tiendas!B23","v":"Descuento ventas por pronto pago producto Bebidas tienda Barcelona 3"}]
[{"$f":"\"70600\"&Familias!$A$5&Tiendas!A24","v":"7060011364"},{"$f":"\"Descuento ventas por pronto pago producto Bebidas tienda\"&\" \"&Tiendas!B24","v":"Descuento ventas por pronto pago producto Bebidas tienda Barcelona 4"}]
[{"$f":"\"70600\"&Familias!$A$5&Tiendas!A25","v":"7060011371"},{"$f":"\"Descuento ventas por pronto pago producto Bebidas tienda\"&\" \"&Tiendas!B25","v":"Descuento ventas por pronto pago producto Bebidas tienda Bilbao 1"}]
[{"$f":"\"70600\"&Familias!$A$5&Tiendas!A26","v":"7060011372"},{"$f":"\"Descuento ventas por pronto pago producto Bebidas tienda\"&\" \"&Tiendas!B26","v":"Descuento ventas por pronto pago producto Bebidas tienda Bilbao 2"}]
[{"$f":"\"70600\"&Familias!$A$5&Tiendas!A27","v":"7060011380"},{"$f":"\"Descuento ventas por pronto pago producto Bebidas tienda\"&\" \"&Tiendas!B27","v":"Descuento ventas por pronto pago producto Bebidas tienda Almacén"}]
[70600121,"Decuentos ventas por pronto pago producto Cerámicas"]
[{"$f":"\"70600\"&Familias!$A$6&Tiendas!A2","v":"7060012111"},{"$f":"\"Descuento ventas por pronto pago producto Cerámicas tienda\"&\" \"&Tiendas!B2","v":"Descuento ventas por pronto pago producto Cerámicas tienda A Coruña 1"}]
[{"$f":"\"70600\"&Familias!$A$6&Tiendas!A3","v":"7060012112"},{"$f":"\"Descuento ventas por pronto pago producto Cerámicas tienda\"&\" \"&Tiendas!B3","v":"Descuento ventas por pronto pago producto Cerámicas tienda A Coruña 2"}]
[{"$f":"\"70600\"&Familias!$A$6&Tiendas!A4","v":"7060012113"},{"$f":"\"Descuento ventas por pronto pago producto Cerámicas tienda\"&\" \"&Tiendas!B4","v":"Descuento ventas por pronto pago producto Cerámicas tienda A Coruña 3"}]
[{"$f":"\"70600\"&Familias!$A$6&Tiendas!A5","v":"7060012114"},{"$f":"\"Descuento ventas por pronto pago producto Cerámicas tienda\"&\" \"&Tiendas!B5","v":"Descuento ventas por pronto pago producto Cerámicas tienda A Coruña 4"}]
[{"$f":"\"70600\"&Familias!$A$6&Tiendas!A6","v":"7060012115"},{"$f":"\"Descuento ventas por pronto pago producto Cerámicas tienda\"&\" \"&Tiendas!B6","v":"Descuento ventas por pronto pago producto Cerámicas tienda A Coruña 5"}]
[{"$f":"\"70600\"&Familias!$A$6&Tiendas!A7","v":"7060012121"},{"$f":"\"Descuento ventas por pronto pago producto Cerámicas tienda\"&\" \"&Tiendas!B7","v":"Descuento ventas por pronto pago producto Cerámicas tienda Lugo 1"}]
[{"$f":"\"70600\"&Familias!$A$6&Tiendas!A8","v":"7060012122"},{"$f":"\"Descuento ventas por pronto pago producto Cerámicas tienda\"&\" \"&Tiendas!B8","v":"Descuento ventas por pronto pago producto Cerámicas tienda Lugo 2"}]
[{"$f":"\"70600\"&Familias!$A$6&Tiendas!A9","v":"7060012131"},{"$f":"\"Descuento ventas por pronto pago producto Cerámicas tienda\"&\" \"&Tiendas!B9","v":"Descuento ventas por pronto pago producto Cerámicas tienda Ourense 1"}]
[{"$f":"\"70600\"&Familias!$A$6&Tiendas!A10","v":"7060012132"},{"$f":"\"Descuento ventas por pronto pago producto Cerámicas tienda\"&\" \"&Tiendas!B10","v":"Descuento ventas por pronto pago producto Cerámicas tienda Ourense 2"}]
[{"$f":"\"70600\"&Familias!$A$6&Tiendas!A11","v":"7060012133"},{"$f":"\"Descuento ventas por pronto pago producto Cerámicas tienda\"&\" \"&Tiendas!B11","v":"Descuento ventas por pronto pago producto Cerámicas tienda Ourense 3"}]
[{"$f":"\"70600\"&Familias!$A$6&Tiendas!A12","v":"7060012141"},{"$f":"\"Descuento ventas por pronto pago producto Cerámicas tienda\"&\" \"&Tiendas!B12","v":"Descuento ventas por pronto pago producto Cerámicas tienda Pontevedra 1"}]
[{"$f":"\"70600\"&Familias!$A$6&Tiendas!A13","v":"7060012142"},{"$f":"\"Descuento ventas por pronto pago producto Cerámicas tienda\"&\" \"&Tiendas!B13","v":"Descuento ventas por pronto pago producto Cerámicas tienda Pontevedra 2"}]
[{"$f":"\"70600\"&Familias!$A$6&Tiendas!A14","v":"7060012143"},{"$f":"\"Descuento ventas por pronto pago producto Cerámicas tienda\"&\" \"&Tiendas!B14","v":"Descuento ventas por pronto pago producto Cerámicas tienda Pontevedra 3"}]
[{"$f":"\"70600\"&Familias!$A$6&Tiendas!A15","v":"7060012144"},{"$f":"\"Descuento ventas por pronto pago producto Cerámicas tienda\"&\" \"&Tiendas!B15","v":"Descuento ventas por pronto pago producto Cerámicas tienda Pontevedra 4"}]
[{"$f":"\"70600\"&Familias!$A$6&Tiendas!A16","v":"7060012151"},{"$f":"\"Descuento ventas por pronto pago producto Cerámicas tienda\"&\" \"&Tiendas!B16","v":"Descuento ventas por pronto pago producto Cerámicas tienda Madrid 1"}]
[{"$f":"\"70600\"&Familias!$A$6&Tiendas!A17","v":"7060012152"},{"$f":"\"Descuento ventas por pronto pago producto Cerámicas tienda\"&\" \"&Tiendas!B17","v":"Descuento ventas por pronto pago producto Cerámicas tienda Madrid 2"}]
[{"$f":"\"70600\"&Familias!$A$6&Tiendas!A18","v":"7060012153"},{"$f":"\"Descuento ventas por pronto pago producto Cerámicas tienda\"&\" \"&Tiendas!B18","v":"Descuento ventas por pronto pago producto Cerámicas tienda Madrid 3"}]
[{"$f":"\"70600\"&Familias!$A$6&Tiendas!A19","v":"7060012154"},{"$f":"\"Descuento ventas por pronto pago producto Cerámicas tienda\"&\" \"&Tiendas!B19","v":"Descuento ventas por pronto pago producto Cerámicas tienda Madrid 4"}]
[{"$f":"\"70600\"&Familias!$A$6&Tiendas!A20","v":"7060012155"},{"$f":"\"Descuento ventas por pronto pago producto Cerámicas tienda\"&\" \"&Tiendas!B20","v":"Descuento ventas por pronto pago producto Cerámicas tienda Madrid 5"}]
[{"$f":"\"70600\"&Familias!$A$6&Tiendas!A21","v":"7060012161"},{"$f":"\"Descuento ventas por pronto pago producto Cerámicas tienda\"&\" \"&Tiendas!B21","v":"Descuento ventas por pronto pago producto Cerámicas tienda Barcelona 1"}]
[{"$f":"\"70600\"&Familias!$A$6&Tiendas!A22","v":"7060012162"},{"$f":"\"Descuento ventas por pronto pago producto Cerámicas tienda\"&\" \"&Tiendas!B22","v":"Descuento ventas por pronto pago producto Cerámicas tienda Barcelona 2"}]
[{"$f":"\"70600\"&Familias!$A$6&Tiendas!A23","v":"7060012163"},{"$f":"\"Descuento ventas por pronto pago producto Cerámicas tienda\"&\" \"&Tiendas!B23","v":"Descuento ventas por pronto pago producto Cerámicas tienda Barcelona 3"}]
[{"$f":"\"70600\"&Familias!$A$6&Tiendas!A24","v":"7060012164"},{"$f":"\"Descuento ventas por pronto pago producto Cerámicas tienda\"&\" \"&Tiendas!B24","v":"Descuento ventas por pronto pago producto Cerámicas tienda Barcelona 4"}]
[{"$f":"\"70600\"&Familias!$A$6&Tiendas!A25","v":"7060012171"},{"$f":"\"Descuento ventas por pronto pago producto Cerámicas tienda\"&\" \"&Tiendas!B25","v":"Descuento ventas por pronto pago producto Cerámicas tienda Bilbao 1"}]
[{"$f":"\"70600\"&Familias!$A$6&Tiendas!A26","v":"7060012172"},{"$f":"\"Descuento ventas por pronto pago producto Cerámicas tienda\"&\" \"&Tiendas!B26","v":"Descuento ventas por pronto pago producto Cerámicas tienda Bilbao 2"}]
[{"$f":"\"70600\"&Familias!$A$6&Tiendas!A27","v":"7060012180"},{"$f":"\"Descuento ventas por pronto pago producto Cerámicas tienda\"&\" \"&Tiendas!B27","v":"Descuento ventas por pronto pago producto Cerámicas tienda Almacén"}]
[70600122,"Descuento ventas por pronto pago producro Encaje"]
[{"$f":"\"70600\"&Familias!$A$7&Tiendas!A2","v":"7060012211"},{"$f":"\"Descuento ventas por pronto pago producto Encaje tienda\"&\" \"&Tiendas!B2","v":"Descuento ventas por pronto pago producto Encaje tienda A Coruña 1"}]
[{"$f":"\"70600\"&Familias!$A$7&Tiendas!A3","v":"7060012212"},{"$f":"\"Descuento ventas por pronto pago producto Encaje tienda\"&\" \"&Tiendas!B3","v":"Descuento ventas por pronto pago producto Encaje tienda A Coruña 2"}]
[{"$f":"\"70600\"&Familias!$A$7&Tiendas!A4","v":"7060012213"},{"$f":"\"Descuento ventas por pronto pago producto Encaje tienda\"&\" \"&Tiendas!B4","v":"Descuento ventas por pronto pago producto Encaje tienda A Coruña 3"}]
[{"$f":"\"70600\"&Familias!$A$7&Tiendas!A5","v":"7060012214"},{"$f":"\"Descuento ventas por pronto pago producto Encaje tienda\"&\" \"&Tiendas!B5","v":"Descuento ventas por pronto pago producto Encaje tienda A Coruña 4"}]
[{"$f":"\"70600\"&Familias!$A$7&Tiendas!A6","v":"7060012215"},{"$f":"\"Descuento ventas por pronto pago producto Encaje tienda\"&\" \"&Tiendas!B6","v":"Descuento ventas por pronto pago producto Encaje tienda A Coruña 5"}]
[{"$f":"\"70600\"&Familias!$A$7&Tiendas!A7","v":"7060012221"},{"$f":"\"Descuento ventas por pronto pago producto Encaje tienda\"&\" \"&Tiendas!B7","v":"Descuento ventas por pronto pago producto Encaje tienda Lugo 1"}]
[{"$f":"\"70600\"&Familias!$A$7&Tiendas!A8","v":"7060012222"},{"$f":"\"Descuento ventas por pronto pago producto Encaje tienda\"&\" \"&Tiendas!B8","v":"Descuento ventas por pronto pago producto Encaje tienda Lugo 2"}]
[{"$f":"\"70600\"&Familias!$A$7&Tiendas!A9","v":"7060012231"},{"$f":"\"Descuento ventas por pronto pago producto Encaje tienda\"&\" \"&Tiendas!B9","v":"Descuento ventas por pronto pago producto Encaje tienda Ourense 1"}]
[{"$f":"\"70600\"&Familias!$A$7&Tiendas!A10","v":"7060012232"},{"$f":"\"Descuento ventas por pronto pago producto Encaje tienda\"&\" \"&Tiendas!B10","v":"Descuento ventas por pronto pago producto Encaje tienda Ourense 2"}]
[{"$f":"\"70600\"&Familias!$A$7&Tiendas!A11","v":"7060012233"},{"$f":"\"Descuento ventas por pronto pago producto Encaje tienda\"&\" \"&Tiendas!B11","v":"Descuento ventas por pronto pago producto Encaje tienda Ourense 3"}]
[{"$f":"\"70600\"&Familias!$A$7&Tiendas!A12","v":"7060012241"},{"$f":"\"Descuento ventas por pronto pago producto Encaje tienda\"&\" \"&Tiendas!B12","v":"Descuento ventas por pronto pago producto Encaje tienda Pontevedra 1"}]
[{"$f":"\"70600\"&Familias!$A$7&Tiendas!A13","v":"7060012242"},{"$f":"\"Descuento ventas por pronto pago producto Encaje tienda\"&\" \"&Tiendas!B13","v":"Descuento ventas por pronto pago producto Encaje tienda Pontevedra 2"}]
[{"$f":"\"70600\"&Familias!$A$7&Tiendas!A14","v":"7060012243"},{"$f":"\"Descuento ventas por pronto pago producto Encaje tienda\"&\" \"&Tiendas!B14","v":"Descuento ventas por pronto pago producto Encaje tienda Pontevedra 3"}]
[{"$f":"\"70600\"&Familias!$A$7&Tiendas!A15","v":"7060012244"},{"$f":"\"Descuento ventas por pronto pago producto Encaje tienda\"&\" \"&Tiendas!B15","v":"Descuento ventas por pronto pago producto Encaje tienda Pontevedra 4"}]
[{"$f":"\"70600\"&Familias!$A$7&Tiendas!A16","v":"7060012251"},{"$f":"\"Descuento ventas por pronto pago producto Encaje tienda\"&\" \"&Tiendas!B16","v":"Descuento ventas por pronto pago producto Encaje tienda Madrid 1"}]
[{"$f":"\"70600\"&Familias!$A$7&Tiendas!A17","v":"7060012252"},{"$f":"\"Descuento ventas por pronto pago producto Encaje tienda\"&\" \"&Tiendas!B17","v":"Descuento ventas por pronto pago producto Encaje tienda Madrid 2"}]
[{"$f":"\"70600\"&Familias!$A$7&Tiendas!A18","v":"7060012253"},{"$f":"\"Descuento ventas por pronto pago producto Encaje tienda\"&\" \"&Tiendas!B18","v":"Descuento ventas por pronto pago producto Encaje tienda Madrid 3"}]
[{"$f":"\"70600\"&Familias!$A$7&Tiendas!A19","v":"7060012254"},{"$f":"\"Descuento ventas por pronto pago producto Encaje tienda\"&\" \"&Tiendas!B19","v":"Descuento ventas por pronto pago producto Encaje tienda Madrid 4"}]
[{"$f":"\"70600\"&Familias!$A$7&Tiendas!A20","v":"7060012255"},{"$f":"\"Descuento ventas por pronto pago producto Encaje tienda\"&\" \"&Tiendas!B20","v":"Descuento ventas por pronto pago producto Encaje tienda Madrid 5"}]
[{"$f":"\"70600\"&Familias!$A$7&Tiendas!A21","v":"7060012261"},{"$f":"\"Descuento ventas por pronto pago producto Encaje tienda\"&\" \"&Tiendas!B21","v":"Descuento ventas por pronto pago producto Encaje tienda Barcelona 1"}]
[{"$f":"\"70600\"&Familias!$A$7&Tiendas!A22","v":"7060012262"},{"$f":"\"Descuento ventas por pronto pago producto Encaje tienda\"&\" \"&Tiendas!B22","v":"Descuento ventas por pronto pago producto Encaje tienda Barcelona 2"}]
[{"$f":"\"70600\"&Familias!$A$7&Tiendas!A23","v":"7060012263"},{"$f":"\"Descuento ventas por pronto pago producto Encaje tienda\"&\" \"&Tiendas!B23","v":"Descuento ventas por pronto pago producto Encaje tienda Barcelona 3"}]
[{"$f":"\"70600\"&Familias!$A$7&Tiendas!A24","v":"7060012264"},{"$f":"\"Descuento ventas por pronto pago producto Encaje tienda\"&\" \"&Tiendas!B24","v":"Descuento ventas por pronto pago producto Encaje tienda Barcelona 4"}]
[{"$f":"\"70600\"&Familias!$A$7&Tiendas!A25","v":"7060012271"},{"$f":"\"Descuento ventas por pronto pago producto Encaje tienda\"&\" \"&Tiendas!B25","v":"Descuento ventas por pronto pago producto Encaje tienda Bilbao 1"}]
[{"$f":"\"70600\"&Familias!$A$7&Tiendas!A26","v":"7060012272"},{"$f":"\"Descuento ventas por pronto pago producto Encaje tienda\"&\" \"&Tiendas!B26","v":"Descuento ventas por pronto pago producto Encaje tienda Bilbao 2"}]
[{"$f":"\"70600\"&Familias!$A$7&Tiendas!A27","v":"7060012280"},{"$f":"\"Descuento ventas por pronto pago producto Encaje tienda\"&\" \"&Tiendas!B27","v":"Descuento ventas por pronto pago producto Encaje tienda Almacén"}]
[70600123,"Descuento ventas por pronto pago producto Cuero"]
[{"$f":"\"70600\"&Familias!$A$8&Tiendas!A2","v":"7060012311"},{"$f":"\"Descuento ventas por pronto pago producto Cuero tienda\"&\" \"&Tiendas!B2","v":"Descuento ventas por pronto pago producto Cuero tienda A Coruña 1"}]
[{"$f":"\"70600\"&Familias!$A$8&Tiendas!A3","v":"7060012312"},{"$f":"\"Descuento ventas por pronto pago producto Cuero tienda\"&\" \"&Tiendas!B3","v":"Descuento ventas por pronto pago producto Cuero tienda A Coruña 2"}]
[{"$f":"\"70600\"&Familias!$A$8&Tiendas!A4","v":"7060012313"},{"$f":"\"Descuento ventas por pronto pago producto Cuero tienda\"&\" \"&Tiendas!B4","v":"Descuento ventas por pronto pago producto Cuero tienda A Coruña 3"}]
[{"$f":"\"70600\"&Familias!$A$8&Tiendas!A5","v":"7060012314"},{"$f":"\"Descuento ventas por pronto pago producto Cuero tienda\"&\" \"&Tiendas!B5","v":"Descuento ventas por pronto pago producto Cuero tienda A Coruña 4"}]
[{"$f":"\"70600\"&Familias!$A$8&Tiendas!A6","v":"7060012315"},{"$f":"\"Descuento ventas por pronto pago producto Cuero tienda\"&\" \"&Tiendas!B6","v":"Descuento ventas por pronto pago producto Cuero tienda A Coruña 5"}]
[{"$f":"\"70600\"&Familias!$A$8&Tiendas!A7","v":"7060012321"},{"$f":"\"Descuento ventas por pronto pago producto Cuero tienda\"&\" \"&Tiendas!B7","v":"Descuento ventas por pronto pago producto Cuero tienda Lugo 1"}]
[{"$f":"\"70600\"&Familias!$A$8&Tiendas!A8","v":"7060012322"},{"$f":"\"Descuento ventas por pronto pago producto Cuero tienda\"&\" \"&Tiendas!B8","v":"Descuento ventas por pronto pago producto Cuero tienda Lugo 2"}]
[{"$f":"\"70600\"&Familias!$A$8&Tiendas!A9","v":"7060012331"},{"$f":"\"Descuento ventas por pronto pago producto Cuero tienda\"&\" \"&Tiendas!B9","v":"Descuento ventas por pronto pago producto Cuero tienda Ourense 1"}]
[{"$f":"\"70600\"&Familias!$A$8&Tiendas!A10","v":"7060012332"},{"$f":"\"Descuento ventas por pronto pago producto Cuero tienda\"&\" \"&Tiendas!B10","v":"Descuento ventas por pronto pago producto Cuero tienda Ourense 2"}]
[{"$f":"\"70600\"&Familias!$A$8&Tiendas!A11","v":"7060012333"},{"$f":"\"Descuento ventas por pronto pago producto Cuero tienda\"&\" \"&Tiendas!B11","v":"Descuento ventas por pronto pago producto Cuero tienda Ourense 3"}]
[{"$f":"\"70600\"&Familias!$A$8&Tiendas!A12","v":"7060012341"},{"$f":"\"Descuento ventas por pronto pago producto Cuero tienda\"&\" \"&Tiendas!B12","v":"Descuento ventas por pronto pago producto Cuero tienda Pontevedra 1"}]
[{"$f":"\"70600\"&Familias!$A$8&Tiendas!A13","v":"7060012342"},{"$f":"\"Descuento ventas por pronto pago producto Cuero tienda\"&\" \"&Tiendas!B13","v":"Descuento ventas por pronto pago producto Cuero tienda Pontevedra 2"}]
[{"$f":"\"70600\"&Familias!$A$8&Tiendas!A14","v":"7060012343"},{"$f":"\"Descuento ventas por pronto pago producto Cuero tienda\"&\" \"&Tiendas!B14","v":"Descuento ventas por pronto pago producto Cuero tienda Pontevedra 3"}]
[{"$f":"\"70600\"&Familias!$A$8&Tiendas!A15","v":"7060012344"},{"$f":"\"Descuento ventas por pronto pago producto Cuero tienda\"&\" \"&Tiendas!B15","v":"Descuento ventas por pronto pago producto Cuero tienda Pontevedra 4"}]
[{"$f":"\"70600\"&Familias!$A$8&Tiendas!A16","v":"7060012351"},{"$f":"\"Descuento ventas por pronto pago producto Cuero tienda\"&\" \"&Tiendas!B16","v":"Descuento ventas por pronto pago producto Cuero tienda Madrid 1"}]
[{"$f":"\"70600\"&Familias!$A$8&Tiendas!A17","v":"7060012352"},{"$f":"\"Descuento ventas por pronto pago producto Cuero tienda\"&\" \"&Tiendas!B17","v":"Descuento ventas por pronto pago producto Cuero tienda Madrid 2"}]
[{"$f":"\"70600\"&Familias!$A$8&Tiendas!A18","v":"7060012353"},{"$f":"\"Descuento ventas por pronto pago producto Cuero tienda\"&\" \"&Tiendas!B18","v":"Descuento ventas por pronto pago producto Cuero tienda Madrid 3"}]
[{"$f":"\"70600\"&Familias!$A$8&Tiendas!A19","v":"7060012354"},{"$f":"\"Descuento ventas por pronto pago producto Cuero tienda\"&\" \"&Tiendas!B19","v":"Descuento ventas por pronto pago producto Cuero tienda Madrid 4"}]
[{"$f":"\"70600\"&Familias!$A$8&Tiendas!A20","v":"7060012355"},{"$f":"\"Descuento ventas por pronto pago producto Cuero tienda\"&\" \"&Tiendas!B20","v":"Descuento ventas por pronto pago producto Cuero tienda Madrid 5"}]
[{"$f":"\"70600\"&Familias!$A$8&Tiendas!A21","v":"7060012361"},{"$f":"\"Descuento ventas por pronto pago producto Cuero tienda\"&\" \"&Tiendas!B21","v":"Descuento ventas por pronto pago producto Cuero tienda Barcelona 1"}]
[{"$f":"\"70600\"&Familias!$A$8&Tiendas!A22","v":"7060012362"},{"$f":"\"Descuento ventas por pronto pago producto Cuero tienda\"&\" \"&Tiendas!B22","v":"Descuento ventas por pronto pago producto Cuero tienda Barcelona 2"}]
[{"$f":"\"70600\"&Familias!$A$8&Tiendas!A23","v":"7060012363"},{"$f":"\"Descuento ventas por pronto pago producto Cuero tienda\"&\" \"&Tiendas!B23","v":"Descuento ventas por pronto pago producto Cuero tienda Barcelona 3"}]
[{"$f":"\"70600\"&Familias!$A$8&Tiendas!A24","v":"7060012364"},{"$f":"\"Descuento ventas por pronto pago producto Cuero tienda\"&\" \"&Tiendas!B24","v":"Descuento ventas por pronto pago producto Cuero tienda Barcelona 4"}]
[{"$f":"\"70600\"&Familias!$A$8&Tiendas!A25","v":"7060012371"},{"$f":"\"Descuento ventas por pronto pago producto Cuero tienda\"&\" \"&Tiendas!B25","v":"Descuento ventas por pronto pago producto Cuero tienda Bilbao 1"}]
[{"$f":"\"70600\"&Familias!$A$8&Tiendas!A26","v":"7060012372"},{"$f":"\"Descuento ventas por pronto pago producto Cuero tienda\"&\" \"&Tiendas!B26","v":"Descuento ventas por pronto pago producto Cuero tienda Bilbao 2"}]
[{"$f":"\"70600\"&Familias!$A$8&Tiendas!A27","v":"7060012380"},{"$f":"\"Descuento ventas por pronto pago producto Cuero tienda\"&\" \"&Tiendas!B27","v":"Descuento ventas por pronto pago producto Cuero tienda Almacén"}]
[7061,"DESCUENTOS SOBRE VENTAS POR PRONTO PAGO DE PRODUCTOS TERMINADOS"]
[7062,"DESCUENTOS SOBRE VENTAS POR PRONTO PAGO DE PRODUCTOS SEMITERMINADOS"]
[7063,"DESCUENTOS SOBRE VENTAS POR PRONTO PAGO DE SUBPRODUCTOS Y RESIDUOS"]
[708,"DEVOLUCIONES DE VENTAS Y OPERACIONES SIMILARES"]
[7080,"DEVOLUCIONES DE VENTAS DE MERCADERÍAS"]
[70800111,"Devoluciones ventas producto Mar"]
[{"$f":"\"70800\"&Familias!$A$3&Tiendas!A2","v":"7080011111"},{"$f":"\"Devoluciones ventas producto Mar tienda\"&\" \"&Tiendas!B2","v":"Devoluciones ventas producto Mar tienda A Coruña 1"}]
[{"$f":"\"70800\"&Familias!$A$3&Tiendas!A3","v":"7080011112"},{"$f":"\"Devoluciones ventas producto Mar tienda\"&\" \"&Tiendas!B3","v":"Devoluciones ventas producto Mar tienda A Coruña 2"}]
[{"$f":"\"70800\"&Familias!$A$3&Tiendas!A4","v":"7080011113"},{"$f":"\"Devoluciones ventas producto Mar tienda\"&\" \"&Tiendas!B4","v":"Devoluciones ventas producto Mar tienda A Coruña 3"}]
[{"$f":"\"70800\"&Familias!$A$3&Tiendas!A5","v":"7080011114"},{"$f":"\"Devoluciones ventas producto Mar tienda\"&\" \"&Tiendas!B5","v":"Devoluciones ventas producto Mar tienda A Coruña 4"}]
[{"$f":"\"70800\"&Familias!$A$3&Tiendas!A6","v":"7080011115"},{"$f":"\"Devoluciones ventas producto Mar tienda\"&\" \"&Tiendas!B6","v":"Devoluciones ventas producto Mar tienda A Coruña 5"}]
[{"$f":"\"70800\"&Familias!$A$3&Tiendas!A7","v":"7080011121"},{"$f":"\"Devoluciones ventas producto Mar tienda\"&\" \"&Tiendas!B7","v":"Devoluciones ventas producto Mar tienda Lugo 1"}]
[{"$f":"\"70800\"&Familias!$A$3&Tiendas!A8","v":"7080011122"},{"$f":"\"Devoluciones ventas producto Mar tienda\"&\" \"&Tiendas!B8","v":"Devoluciones ventas producto Mar tienda Lugo 2"}]
[{"$f":"\"70800\"&Familias!$A$3&Tiendas!A9","v":"7080011131"},{"$f":"\"Devoluciones ventas producto Mar tienda\"&\" \"&Tiendas!B9","v":"Devoluciones ventas producto Mar tienda Ourense 1"}]
[{"$f":"\"70800\"&Familias!$A$3&Tiendas!A10","v":"7080011132"},{"$f":"\"Devoluciones ventas producto Mar tienda\"&\" \"&Tiendas!B10","v":"Devoluciones ventas producto Mar tienda Ourense 2"}]
[{"$f":"\"70800\"&Familias!$A$3&Tiendas!A11","v":"7080011133"},{"$f":"\"Devoluciones ventas producto Mar tienda\"&\" \"&Tiendas!B11","v":"Devoluciones ventas producto Mar tienda Ourense 3"}]
[{"$f":"\"70800\"&Familias!$A$3&Tiendas!A12","v":"7080011141"},{"$f":"\"Devoluciones ventas producto Mar tienda\"&\" \"&Tiendas!B12","v":"Devoluciones ventas producto Mar tienda Pontevedra 1"}]
[{"$f":"\"70800\"&Familias!$A$3&Tiendas!A13","v":"7080011142"},{"$f":"\"Devoluciones ventas producto Mar tienda\"&\" \"&Tiendas!B13","v":"Devoluciones ventas producto Mar tienda Pontevedra 2"}]
[{"$f":"\"70800\"&Familias!$A$3&Tiendas!A14","v":"7080011143"},{"$f":"\"Devoluciones ventas producto Mar tienda\"&\" \"&Tiendas!B14","v":"Devoluciones ventas producto Mar tienda Pontevedra 3"}]
[{"$f":"\"70800\"&Familias!$A$3&Tiendas!A15","v":"7080011144"},{"$f":"\"Devoluciones ventas producto Mar tienda\"&\" \"&Tiendas!B15","v":"Devoluciones ventas producto Mar tienda Pontevedra 4"}]
[{"$f":"\"70800\"&Familias!$A$3&Tiendas!A16","v":"7080011151"},{"$f":"\"Devoluciones ventas producto Mar tienda\"&\" \"&Tiendas!B16","v":"Devoluciones ventas producto Mar tienda Madrid 1"}]
[{"$f":"\"70800\"&Familias!$A$3&Tiendas!A17","v":"7080011152"},{"$f":"\"Devoluciones ventas producto Mar tienda\"&\" \"&Tiendas!B17","v":"Devoluciones ventas producto Mar tienda Madrid 2"}]
[{"$f":"\"70800\"&Familias!$A$3&Tiendas!A18","v":"7080011153"},{"$f":"\"Devoluciones ventas producto Mar tienda\"&\" \"&Tiendas!B18","v":"Devoluciones ventas producto Mar tienda Madrid 3"}]
[{"$f":"\"70800\"&Familias!$A$3&Tiendas!A19","v":"7080011154"},{"$f":"\"Devoluciones ventas producto Mar tienda\"&\" \"&Tiendas!B19","v":"Devoluciones ventas producto Mar tienda Madrid 4"}]
[{"$f":"\"70800\"&Familias!$A$3&Tiendas!A20","v":"7080011155"},{"$f":"\"Devoluciones ventas producto Mar tienda\"&\" \"&Tiendas!B20","v":"Devoluciones ventas producto Mar tienda Madrid 5"}]
[{"$f":"\"70800\"&Familias!$A$3&Tiendas!A21","v":"7080011161"},{"$f":"\"Devoluciones ventas producto Mar tienda\"&\" \"&Tiendas!B21","v":"Devoluciones ventas producto Mar tienda Barcelona 1"}]
[{"$f":"\"70800\"&Familias!$A$3&Tiendas!A22","v":"7080011162"},{"$f":"\"Devoluciones ventas producto Mar tienda\"&\" \"&Tiendas!B22","v":"Devoluciones ventas producto Mar tienda Barcelona 2"}]
[{"$f":"\"70800\"&Familias!$A$3&Tiendas!A23","v":"7080011163"},{"$f":"\"Devoluciones ventas producto Mar tienda\"&\" \"&Tiendas!B23","v":"Devoluciones ventas producto Mar tienda Barcelona 3"}]
[{"$f":"\"70800\"&Familias!$A$3&Tiendas!A24","v":"7080011164"},{"$f":"\"Devoluciones ventas producto Mar tienda\"&\" \"&Tiendas!B24","v":"Devoluciones ventas producto Mar tienda Barcelona 4"}]
[{"$f":"\"70800\"&Familias!$A$3&Tiendas!A25","v":"7080011171"},{"$f":"\"Devoluciones ventas producto Mar tienda\"&\" \"&Tiendas!B25","v":"Devoluciones ventas producto Mar tienda Bilbao 1"}]
[{"$f":"\"70800\"&Familias!$A$3&Tiendas!A26","v":"7080011172"},{"$f":"\"Devoluciones ventas producto Mar tienda\"&\" \"&Tiendas!B26","v":"Devoluciones ventas producto Mar tienda Bilbao 2"}]
[{"$f":"\"70800\"&Familias!$A$3&Tiendas!A27","v":"7080011180"},{"$f":"\"Devoluciones ventas producto Mar tienda\"&\" \"&Tiendas!B27","v":"Devoluciones ventas producto Mar tienda Almacén"}]
[70800112,"Devoluciones ventas producto Campo"]
[{"$f":"\"70800\"&Familias!$A$4&Tiendas!A2","v":"7080011211"},{"$f":"\"Devoluciones ventas producto Campo tienda\"&\" \"&Tiendas!B2","v":"Devoluciones ventas producto Campo tienda A Coruña 1"}]
[{"$f":"\"70800\"&Familias!$A$4&Tiendas!A3","v":"7080011212"},{"$f":"\"Devoluciones ventas producto Campo tienda\"&\" \"&Tiendas!B3","v":"Devoluciones ventas producto Campo tienda A Coruña 2"}]
[{"$f":"\"70800\"&Familias!$A$4&Tiendas!A4","v":"7080011213"},{"$f":"\"Devoluciones ventas producto Campo tienda\"&\" \"&Tiendas!B4","v":"Devoluciones ventas producto Campo tienda A Coruña 3"}]
[{"$f":"\"70800\"&Familias!$A$4&Tiendas!A5","v":"7080011214"},{"$f":"\"Devoluciones ventas producto Campo tienda\"&\" \"&Tiendas!B5","v":"Devoluciones ventas producto Campo tienda A Coruña 4"}]
[{"$f":"\"70800\"&Familias!$A$4&Tiendas!A6","v":"7080011215"},{"$f":"\"Devoluciones ventas producto Campo tienda\"&\" \"&Tiendas!B6","v":"Devoluciones ventas producto Campo tienda A Coruña 5"}]
[{"$f":"\"70800\"&Familias!$A$4&Tiendas!A7","v":"7080011221"},{"$f":"\"Devoluciones ventas producto Campo tienda\"&\" \"&Tiendas!B7","v":"Devoluciones ventas producto Campo tienda Lugo 1"}]
[{"$f":"\"70800\"&Familias!$A$4&Tiendas!A8","v":"7080011222"},{"$f":"\"Devoluciones ventas producto Campo tienda\"&\" \"&Tiendas!B8","v":"Devoluciones ventas producto Campo tienda Lugo 2"}]
[{"$f":"\"70800\"&Familias!$A$4&Tiendas!A9","v":"7080011231"},{"$f":"\"Devoluciones ventas producto Campo tienda\"&\" \"&Tiendas!B9","v":"Devoluciones ventas producto Campo tienda Ourense 1"}]
[{"$f":"\"70800\"&Familias!$A$4&Tiendas!A10","v":"7080011232"},{"$f":"\"Devoluciones ventas producto Campo tienda\"&\" \"&Tiendas!B10","v":"Devoluciones ventas producto Campo tienda Ourense 2"}]
[{"$f":"\"70800\"&Familias!$A$4&Tiendas!A11","v":"7080011233"},{"$f":"\"Devoluciones ventas producto Campo tienda\"&\" \"&Tiendas!B11","v":"Devoluciones ventas producto Campo tienda Ourense 3"}]
[{"$f":"\"70800\"&Familias!$A$4&Tiendas!A12","v":"7080011241"},{"$f":"\"Devoluciones ventas producto Campo tienda\"&\" \"&Tiendas!B12","v":"Devoluciones ventas producto Campo tienda Pontevedra 1"}]
[{"$f":"\"70800\"&Familias!$A$4&Tiendas!A13","v":"7080011242"},{"$f":"\"Devoluciones ventas producto Campo tienda\"&\" \"&Tiendas!B13","v":"Devoluciones ventas producto Campo tienda Pontevedra 2"}]
[{"$f":"\"70800\"&Familias!$A$4&Tiendas!A14","v":"7080011243"},{"$f":"\"Devoluciones ventas producto Campo tienda\"&\" \"&Tiendas!B14","v":"Devoluciones ventas producto Campo tienda Pontevedra 3"}]
[{"$f":"\"70800\"&Familias!$A$4&Tiendas!A15","v":"7080011244"},{"$f":"\"Devoluciones ventas producto Campo tienda\"&\" \"&Tiendas!B15","v":"Devoluciones ventas producto Campo tienda Pontevedra 4"}]
[{"$f":"\"70800\"&Familias!$A$4&Tiendas!A16","v":"7080011251"},{"$f":"\"Devoluciones ventas producto Campo tienda\"&\" \"&Tiendas!B16","v":"Devoluciones ventas producto Campo tienda Madrid 1"}]
[{"$f":"\"70800\"&Familias!$A$4&Tiendas!A17","v":"7080011252"},{"$f":"\"Devoluciones ventas producto Campo tienda\"&\" \"&Tiendas!B17","v":"Devoluciones ventas producto Campo tienda Madrid 2"}]
[{"$f":"\"70800\"&Familias!$A$4&Tiendas!A18","v":"7080011253"},{"$f":"\"Devoluciones ventas producto Campo tienda\"&\" \"&Tiendas!B18","v":"Devoluciones ventas producto Campo tienda Madrid 3"}]
[{"$f":"\"70800\"&Familias!$A$4&Tiendas!A19","v":"7080011254"},{"$f":"\"Devoluciones ventas producto Campo tienda\"&\" \"&Tiendas!B19","v":"Devoluciones ventas producto Campo tienda Madrid 4"}]
[{"$f":"\"70800\"&Familias!$A$4&Tiendas!A20","v":"7080011255"},{"$f":"\"Devoluciones ventas producto Campo tienda\"&\" \"&Tiendas!B20","v":"Devoluciones ventas producto Campo tienda Madrid 5"}]
[{"$f":"\"70800\"&Familias!$A$4&Tiendas!A21","v":"7080011261"},{"$f":"\"Devoluciones ventas producto Campo tienda\"&\" \"&Tiendas!B21","v":"Devoluciones ventas producto Campo tienda Barcelona 1"}]
[{"$f":"\"70800\"&Familias!$A$4&Tiendas!A22","v":"7080011262"},{"$f":"\"Devoluciones ventas producto Campo tienda\"&\" \"&Tiendas!B22","v":"Devoluciones ventas producto Campo tienda Barcelona 2"}]
[{"$f":"\"70800\"&Familias!$A$4&Tiendas!A23","v":"7080011263"},{"$f":"\"Devoluciones ventas producto Campo tienda\"&\" \"&Tiendas!B23","v":"Devoluciones ventas producto Campo tienda Barcelona 3"}]
[{"$f":"\"70800\"&Familias!$A$4&Tiendas!A24","v":"7080011264"},{"$f":"\"Devoluciones ventas producto Campo tienda\"&\" \"&Tiendas!B24","v":"Devoluciones ventas producto Campo tienda Barcelona 4"}]
[{"$f":"\"70800\"&Familias!$A$4&Tiendas!A25","v":"7080011271"},{"$f":"\"Devoluciones ventas producto Campo tienda\"&\" \"&Tiendas!B25","v":"Devoluciones ventas producto Campo tienda Bilbao 1"}]
[{"$f":"\"70800\"&Familias!$A$4&Tiendas!A26","v":"7080011272"},{"$f":"\"Devoluciones ventas producto Campo tienda\"&\" \"&Tiendas!B26","v":"Devoluciones ventas producto Campo tienda Bilbao 2"}]
[{"$f":"\"70800\"&Familias!$A$4&Tiendas!A27","v":"7080011280"},{"$f":"\"Devoluciones ventas producto Campo tienda\"&\" \"&Tiendas!B27","v":"Devoluciones ventas producto Campo tienda Almacén"}]
[70800113,"Devoluciones ventas producto Bebidas"]
[{"$f":"\"70800\"&Familias!$A$5&Tiendas!A2","v":"7080011311"},{"$f":"\"Devoluciones ventas producto Bebidas tienda\"&\" \"&Tiendas!B2","v":"Devoluciones ventas producto Bebidas tienda A Coruña 1"}]
[{"$f":"\"70800\"&Familias!$A$5&Tiendas!A3","v":"7080011312"},{"$f":"\"Devoluciones ventas producto Bebidas tienda\"&\" \"&Tiendas!B3","v":"Devoluciones ventas producto Bebidas tienda A Coruña 2"}]
[{"$f":"\"70800\"&Familias!$A$5&Tiendas!A4","v":"7080011313"},{"$f":"\"Devoluciones ventas producto Bebidas tienda\"&\" \"&Tiendas!B4","v":"Devoluciones ventas producto Bebidas tienda A Coruña 3"}]
[{"$f":"\"70800\"&Familias!$A$5&Tiendas!A5","v":"7080011314"},{"$f":"\"Devoluciones ventas producto Bebidas tienda\"&\" \"&Tiendas!B5","v":"Devoluciones ventas producto Bebidas tienda A Coruña 4"}]
[{"$f":"\"70800\"&Familias!$A$5&Tiendas!A6","v":"7080011315"},{"$f":"\"Devoluciones ventas producto Bebidas tienda\"&\" \"&Tiendas!B6","v":"Devoluciones ventas producto Bebidas tienda A Coruña 5"}]
[{"$f":"\"70800\"&Familias!$A$5&Tiendas!A7","v":"7080011321"},{"$f":"\"Devoluciones ventas producto Bebidas tienda\"&\" \"&Tiendas!B7","v":"Devoluciones ventas producto Bebidas tienda Lugo 1"}]
[{"$f":"\"70800\"&Familias!$A$5&Tiendas!A8","v":"7080011322"},{"$f":"\"Devoluciones ventas producto Bebidas tienda\"&\" \"&Tiendas!B8","v":"Devoluciones ventas producto Bebidas tienda Lugo 2"}]
[{"$f":"\"70800\"&Familias!$A$5&Tiendas!A9","v":"7080011331"},{"$f":"\"Devoluciones ventas producto Bebidas tienda\"&\" \"&Tiendas!B9","v":"Devoluciones ventas producto Bebidas tienda Ourense 1"}]
[{"$f":"\"70800\"&Familias!$A$5&Tiendas!A10","v":"7080011332"},{"$f":"\"Devoluciones ventas producto Bebidas tienda\"&\" \"&Tiendas!B10","v":"Devoluciones ventas producto Bebidas tienda Ourense 2"}]
[{"$f":"\"70800\"&Familias!$A$5&Tiendas!A11","v":"7080011333"},{"$f":"\"Devoluciones ventas producto Bebidas tienda\"&\" \"&Tiendas!B11","v":"Devoluciones ventas producto Bebidas tienda Ourense 3"}]
[{"$f":"\"70800\"&Familias!$A$5&Tiendas!A12","v":"7080011341"},{"$f":"\"Devoluciones ventas producto Bebidas tienda\"&\" \"&Tiendas!B12","v":"Devoluciones ventas producto Bebidas tienda Pontevedra 1"}]
[{"$f":"\"70800\"&Familias!$A$5&Tiendas!A13","v":"7080011342"},{"$f":"\"Devoluciones ventas producto Bebidas tienda\"&\" \"&Tiendas!B13","v":"Devoluciones ventas producto Bebidas tienda Pontevedra 2"}]
[{"$f":"\"70800\"&Familias!$A$5&Tiendas!A14","v":"7080011343"},{"$f":"\"Devoluciones ventas producto Bebidas tienda\"&\" \"&Tiendas!B14","v":"Devoluciones ventas producto Bebidas tienda Pontevedra 3"}]
[{"$f":"\"70800\"&Familias!$A$5&Tiendas!A15","v":"7080011344"},{"$f":"\"Devoluciones ventas producto Bebidas tienda\"&\" \"&Tiendas!B15","v":"Devoluciones ventas producto Bebidas tienda Pontevedra 4"}]
[{"$f":"\"70800\"&Familias!$A$5&Tiendas!A16","v":"7080011351"},{"$f":"\"Devoluciones ventas producto Bebidas tienda\"&\" \"&Tiendas!B16","v":"Devoluciones ventas producto Bebidas tienda Madrid 1"}]
[{"$f":"\"70800\"&Familias!$A$5&Tiendas!A17","v":"7080011352"},{"$f":"\"Devoluciones ventas producto Bebidas tienda\"&\" \"&Tiendas!B17","v":"Devoluciones ventas producto Bebidas tienda Madrid 2"}]
[{"$f":"\"70800\"&Familias!$A$5&Tiendas!A18","v":"7080011353"},{"$f":"\"Devoluciones ventas producto Bebidas tienda\"&\" \"&Tiendas!B18","v":"Devoluciones ventas producto Bebidas tienda Madrid 3"}]
[{"$f":"\"70800\"&Familias!$A$5&Tiendas!A19","v":"7080011354"},{"$f":"\"Devoluciones ventas producto Bebidas tienda\"&\" \"&Tiendas!B19","v":"Devoluciones ventas producto Bebidas tienda Madrid 4"}]
[{"$f":"\"70800\"&Familias!$A$5&Tiendas!A20","v":"7080011355"},{"$f":"\"Devoluciones ventas producto Bebidas tienda\"&\" \"&Tiendas!B20","v":"Devoluciones ventas producto Bebidas tienda Madrid 5"}]
[{"$f":"\"70800\"&Familias!$A$5&Tiendas!A21","v":"7080011361"},{"$f":"\"Devoluciones ventas producto Bebidas tienda\"&\" \"&Tiendas!B21","v":"Devoluciones ventas producto Bebidas tienda Barcelona 1"}]
[{"$f":"\"70800\"&Familias!$A$5&Tiendas!A22","v":"7080011362"},{"$f":"\"Devoluciones ventas producto Bebidas tienda\"&\" \"&Tiendas!B22","v":"Devoluciones ventas producto Bebidas tienda Barcelona 2"}]
[{"$f":"\"70800\"&Familias!$A$5&Tiendas!A23","v":"7080011363"},{"$f":"\"Devoluciones ventas producto Bebidas tienda\"&\" \"&Tiendas!B23","v":"Devoluciones ventas producto Bebidas tienda Barcelona 3"}]
[{"$f":"\"70800\"&Familias!$A$5&Tiendas!A24","v":"7080011364"},{"$f":"\"Devoluciones ventas producto Bebidas tienda\"&\" \"&Tiendas!B24","v":"Devoluciones ventas producto Bebidas tienda Barcelona 4"}]
[{"$f":"\"70800\"&Familias!$A$5&Tiendas!A25","v":"7080011371"},{"$f":"\"Devoluciones ventas producto Bebidas tienda\"&\" \"&Tiendas!B25","v":"Devoluciones ventas producto Bebidas tienda Bilbao 1"}]
[{"$f":"\"70800\"&Familias!$A$5&Tiendas!A26","v":"7080011372"},{"$f":"\"Devoluciones ventas producto Bebidas tienda\"&\" \"&Tiendas!B26","v":"Devoluciones ventas producto Bebidas tienda Bilbao 2"}]
[{"$f":"\"70800\"&Familias!$A$5&Tiendas!A27","v":"7080011380"},{"$f":"\"Devoluciones ventas producto Bebidas tienda\"&\" \"&Tiendas!B27","v":"Devoluciones ventas producto Bebidas tienda Almacén"}]
[70800121,"Devoluciones ventas producto Cerámicas"]
[{"$f":"\"70800\"&Familias!$A$6&Tiendas!A2","v":"7080012111"},{"$f":"\"Devoluciones ventas producto Cerámicas tienda\"&\" \"&Tiendas!B2","v":"Devoluciones ventas producto Cerámicas tienda A Coruña 1"}]
[{"$f":"\"70800\"&Familias!$A$6&Tiendas!A3","v":"7080012112"},{"$f":"\"Devoluciones ventas producto Cerámicas tienda\"&\" \"&Tiendas!B3","v":"Devoluciones ventas producto Cerámicas tienda A Coruña 2"}]
[{"$f":"\"70800\"&Familias!$A$6&Tiendas!A4","v":"7080012113"},{"$f":"\"Devoluciones ventas producto Cerámicas tienda\"&\" \"&Tiendas!B4","v":"Devoluciones ventas producto Cerámicas tienda A Coruña 3"}]
[{"$f":"\"70800\"&Familias!$A$6&Tiendas!A5","v":"7080012114"},{"$f":"\"Devoluciones ventas producto Cerámicas tienda\"&\" \"&Tiendas!B5","v":"Devoluciones ventas producto Cerámicas tienda A Coruña 4"}]
[{"$f":"\"70800\"&Familias!$A$6&Tiendas!A6","v":"7080012115"},{"$f":"\"Devoluciones ventas producto Cerámicas tienda\"&\" \"&Tiendas!B6","v":"Devoluciones ventas producto Cerámicas tienda A Coruña 5"}]
[{"$f":"\"70800\"&Familias!$A$6&Tiendas!A7","v":"7080012121"},{"$f":"\"Devoluciones ventas producto Cerámicas tienda\"&\" \"&Tiendas!B7","v":"Devoluciones ventas producto Cerámicas tienda Lugo 1"}]
[{"$f":"\"70800\"&Familias!$A$6&Tiendas!A8","v":"7080012122"},{"$f":"\"Devoluciones ventas producto Cerámicas tienda\"&\" \"&Tiendas!B8","v":"Devoluciones ventas producto Cerámicas tienda Lugo 2"}]
[{"$f":"\"70800\"&Familias!$A$6&Tiendas!A9","v":"7080012131"},{"$f":"\"Devoluciones ventas producto Cerámicas tienda\"&\" \"&Tiendas!B9","v":"Devoluciones ventas producto Cerámicas tienda Ourense 1"}]
[{"$f":"\"70800\"&Familias!$A$6&Tiendas!A10","v":"7080012132"},{"$f":"\"Devoluciones ventas producto Cerámicas tienda\"&\" \"&Tiendas!B10","v":"Devoluciones ventas producto Cerámicas tienda Ourense 2"}]
[{"$f":"\"70800\"&Familias!$A$6&Tiendas!A11","v":"7080012133"},{"$f":"\"Devoluciones ventas producto Cerámicas tienda\"&\" \"&Tiendas!B11","v":"Devoluciones ventas producto Cerámicas tienda Ourense 3"}]
[{"$f":"\"70800\"&Familias!$A$6&Tiendas!A12","v":"7080012141"},{"$f":"\"Devoluciones ventas producto Cerámicas tienda\"&\" \"&Tiendas!B12","v":"Devoluciones ventas producto Cerámicas tienda Pontevedra 1"}]
[{"$f":"\"70800\"&Familias!$A$6&Tiendas!A13","v":"7080012142"},{"$f":"\"Devoluciones ventas producto Cerámicas tienda\"&\" \"&Tiendas!B13","v":"Devoluciones ventas producto Cerámicas tienda Pontevedra 2"}]
[{"$f":"\"70800\"&Familias!$A$6&Tiendas!A14","v":"7080012143"},{"$f":"\"Devoluciones ventas producto Cerámicas tienda\"&\" \"&Tiendas!B14","v":"Devoluciones ventas producto Cerámicas tienda Pontevedra 3"}]
[{"$f":"\"70800\"&Familias!$A$6&Tiendas!A15","v":"7080012144"},{"$f":"\"Devoluciones ventas producto Cerámicas tienda\"&\" \"&Tiendas!B15","v":"Devoluciones ventas producto Cerámicas tienda Pontevedra 4"}]
[{"$f":"\"70800\"&Familias!$A$6&Tiendas!A16","v":"7080012151"},{"$f":"\"Devoluciones ventas producto Cerámicas tienda\"&\" \"&Tiendas!B16","v":"Devoluciones ventas producto Cerámicas tienda Madrid 1"}]
[{"$f":"\"70800\"&Familias!$A$6&Tiendas!A17","v":"7080012152"},{"$f":"\"Devoluciones ventas producto Cerámicas tienda\"&\" \"&Tiendas!B17","v":"Devoluciones ventas producto Cerámicas tienda Madrid 2"}]
[{"$f":"\"70800\"&Familias!$A$6&Tiendas!A18","v":"7080012153"},{"$f":"\"Devoluciones ventas producto Cerámicas tienda\"&\" \"&Tiendas!B18","v":"Devoluciones ventas producto Cerámicas tienda Madrid 3"}]
[{"$f":"\"70800\"&Familias!$A$6&Tiendas!A19","v":"7080012154"},{"$f":"\"Devoluciones ventas producto Cerámicas tienda\"&\" \"&Tiendas!B19","v":"Devoluciones ventas producto Cerámicas tienda Madrid 4"}]
[{"$f":"\"70800\"&Familias!$A$6&Tiendas!A20","v":"7080012155"},{"$f":"\"Devoluciones ventas producto Cerámicas tienda\"&\" \"&Tiendas!B20","v":"Devoluciones ventas producto Cerámicas tienda Madrid 5"}]
[{"$f":"\"70800\"&Familias!$A$6&Tiendas!A21","v":"7080012161"},{"$f":"\"Devoluciones ventas producto Cerámicas tienda\"&\" \"&Tiendas!B21","v":"Devoluciones ventas producto Cerámicas tienda Barcelona 1"}]
[{"$f":"\"70800\"&Familias!$A$6&Tiendas!A22","v":"7080012162"},{"$f":"\"Devoluciones ventas producto Cerámicas tienda\"&\" \"&Tiendas!B22","v":"Devoluciones ventas producto Cerámicas tienda Barcelona 2"}]
[{"$f":"\"70800\"&Familias!$A$6&Tiendas!A23","v":"7080012163"},{"$f":"\"Devoluciones ventas producto Cerámicas tienda\"&\" \"&Tiendas!B23","v":"Devoluciones ventas producto Cerámicas tienda Barcelona 3"}]
[{"$f":"\"70800\"&Familias!$A$6&Tiendas!A24","v":"7080012164"},{"$f":"\"Devoluciones ventas producto Cerámicas tienda\"&\" \"&Tiendas!B24","v":"Devoluciones ventas producto Cerámicas tienda Barcelona 4"}]
[{"$f":"\"70800\"&Familias!$A$6&Tiendas!A25","v":"7080012171"},{"$f":"\"Devoluciones ventas producto Cerámicas tienda\"&\" \"&Tiendas!B25","v":"Devoluciones ventas producto Cerámicas tienda Bilbao 1"}]
[{"$f":"\"70800\"&Familias!$A$6&Tiendas!A26","v":"7080012172"},{"$f":"\"Devoluciones ventas producto Cerámicas tienda\"&\" \"&Tiendas!B26","v":"Devoluciones ventas producto Cerámicas tienda Bilbao 2"}]
[{"$f":"\"70800\"&Familias!$A$6&Tiendas!A27","v":"7080012180"},{"$f":"\"Devoluciones ventas producto Cerámicas tienda\"&\" \"&Tiendas!B27","v":"Devoluciones ventas producto Cerámicas tienda Almacén"}]
[70800122,"Devoluciones ventas productos Encaje"]
[{"$f":"\"70800\"&Familias!$A$7&Tiendas!A2","v":"7080012211"},{"$f":"\"Devoluciones ventas productos Encaje tienda\"&\" \"&Tiendas!B2","v":"Devoluciones ventas productos Encaje tienda A Coruña 1"}]
[{"$f":"\"70800\"&Familias!$A$7&Tiendas!A3","v":"7080012212"},{"$f":"\"Devoluciones ventas productos Encaje tienda\"&\" \"&Tiendas!B3","v":"Devoluciones ventas productos Encaje tienda A Coruña 2"}]
[{"$f":"\"70800\"&Familias!$A$7&Tiendas!A4","v":"7080012213"},{"$f":"\"Devoluciones ventas productos Encaje tienda\"&\" \"&Tiendas!B4","v":"Devoluciones ventas productos Encaje tienda A Coruña 3"}]
[{"$f":"\"70800\"&Familias!$A$7&Tiendas!A5","v":"7080012214"},{"$f":"\"Devoluciones ventas productos Encaje tienda\"&\" \"&Tiendas!B5","v":"Devoluciones ventas productos Encaje tienda A Coruña 4"}]
[{"$f":"\"70800\"&Familias!$A$7&Tiendas!A6","v":"7080012215"},{"$f":"\"Devoluciones ventas productos Encaje tienda\"&\" \"&Tiendas!B6","v":"Devoluciones ventas productos Encaje tienda A Coruña 5"}]
[{"$f":"\"70800\"&Familias!$A$7&Tiendas!A7","v":"7080012221"},{"$f":"\"Devoluciones ventas productos Encaje tienda\"&\" \"&Tiendas!B7","v":"Devoluciones ventas productos Encaje tienda Lugo 1"}]
[{"$f":"\"70800\"&Familias!$A$7&Tiendas!A8","v":"7080012222"},{"$f":"\"Devoluciones ventas productos Encaje tienda\"&\" \"&Tiendas!B8","v":"Devoluciones ventas productos Encaje tienda Lugo 2"}]
[{"$f":"\"70800\"&Familias!$A$7&Tiendas!A9","v":"7080012231"},{"$f":"\"Devoluciones ventas productos Encaje tienda\"&\" \"&Tiendas!B9","v":"Devoluciones ventas productos Encaje tienda Ourense 1"}]
[{"$f":"\"70800\"&Familias!$A$7&Tiendas!A10","v":"7080012232"},{"$f":"\"Devoluciones ventas productos Encaje tienda\"&\" \"&Tiendas!B10","v":"Devoluciones ventas productos Encaje tienda Ourense 2"}]
[{"$f":"\"70800\"&Familias!$A$7&Tiendas!A11","v":"7080012233"},{"$f":"\"Devoluciones ventas productos Encaje tienda\"&\" \"&Tiendas!B11","v":"Devoluciones ventas productos Encaje tienda Ourense 3"}]
[{"$f":"\"70800\"&Familias!$A$7&Tiendas!A12","v":"7080012241"},{"$f":"\"Devoluciones ventas productos Encaje tienda\"&\" \"&Tiendas!B12","v":"Devoluciones ventas productos Encaje tienda Pontevedra 1"}]
[{"$f":"\"70800\"&Familias!$A$7&Tiendas!A13","v":"7080012242"},{"$f":"\"Devoluciones ventas productos Encaje tienda\"&\" \"&Tiendas!B13","v":"Devoluciones ventas productos Encaje tienda Pontevedra 2"}]
[{"$f":"\"70800\"&Familias!$A$7&Tiendas!A14","v":"7080012243"},{"$f":"\"Devoluciones ventas productos Encaje tienda\"&\" \"&Tiendas!B14","v":"Devoluciones ventas productos Encaje tienda Pontevedra 3"}]
[{"$f":"\"70800\"&Familias!$A$7&Tiendas!A15","v":"7080012244"},{"$f":"\"Devoluciones ventas productos Encaje tienda\"&\" \"&Tiendas!B15","v":"Devoluciones ventas productos Encaje tienda Pontevedra 4"}]
[{"$f":"\"70800\"&Familias!$A$7&Tiendas!A16","v":"7080012251"},{"$f":"\"Devoluciones ventas productos Encaje tienda\"&\" \"&Tiendas!B16","v":"Devoluciones ventas productos Encaje tienda Madrid 1"}]
[{"$f":"\"70800\"&Familias!$A$7&Tiendas!A17","v":"7080012252"},{"$f":"\"Devoluciones ventas productos Encaje tienda\"&\" \"&Tiendas!B17","v":"Devoluciones ventas productos Encaje tienda Madrid 2"}]
[{"$f":"\"70800\"&Familias!$A$7&Tiendas!A18","v":"7080012253"},{"$f":"\"Devoluciones ventas productos Encaje tienda\"&\" \"&Tiendas!B18","v":"Devoluciones ventas productos Encaje tienda Madrid 3"}]
[{"$f":"\"70800\"&Familias!$A$7&Tiendas!A19","v":"7080012254"},{"$f":"\"Devoluciones ventas productos Encaje tienda\"&\" \"&Tiendas!B19","v":"Devoluciones ventas productos Encaje tienda Madrid 4"}]
[{"$f":"\"70800\"&Familias!$A$7&Tiendas!A20","v":"7080012255"},{"$f":"\"Devoluciones ventas productos Encaje tienda\"&\" \"&Tiendas!B20","v":"Devoluciones ventas productos Encaje tienda Madrid 5"}]
[{"$f":"\"70800\"&Familias!$A$7&Tiendas!A21","v":"7080012261"},{"$f":"\"Devoluciones ventas productos Encaje tienda\"&\" \"&Tiendas!B21","v":"Devoluciones ventas productos Encaje tienda Barcelona 1"}]
[{"$f":"\"70800\"&Familias!$A$7&Tiendas!A22","v":"7080012262"},{"$f":"\"Devoluciones ventas productos Encaje tienda\"&\" \"&Tiendas!B22","v":"Devoluciones ventas productos Encaje tienda Barcelona 2"}]
[{"$f":"\"70800\"&Familias!$A$7&Tiendas!A23","v":"7080012263"},{"$f":"\"Devoluciones ventas productos Encaje tienda\"&\" \"&Tiendas!B23","v":"Devoluciones ventas productos Encaje tienda Barcelona 3"}]
[{"$f":"\"70800\"&Familias!$A$7&Tiendas!A24","v":"7080012264"},{"$f":"\"Devoluciones ventas productos Encaje tienda\"&\" \"&Tiendas!B24","v":"Devoluciones ventas productos Encaje tienda Barcelona 4"}]
[{"$f":"\"70800\"&Familias!$A$7&Tiendas!A25","v":"7080012271"},{"$f":"\"Devoluciones ventas productos Encaje tienda\"&\" \"&Tiendas!B25","v":"Devoluciones ventas productos Encaje tienda Bilbao 1"}]
[{"$f":"\"70800\"&Familias!$A$7&Tiendas!A26","v":"7080012272"},{"$f":"\"Devoluciones ventas productos Encaje tienda\"&\" \"&Tiendas!B26","v":"Devoluciones ventas productos Encaje tienda Bilbao 2"}]
[{"$f":"\"70800\"&Familias!$A$7&Tiendas!A27","v":"7080012280"},{"$f":"\"Devoluciones ventas productos Encaje tienda\"&\" \"&Tiendas!B27","v":"Devoluciones ventas productos Encaje tienda Almacén"}]
[70800123,"Devoluciones ventas producto Cuero"]
[{"$f":"\"70800\"&Familias!$A$8&Tiendas!A2","v":"7080012311"},{"$f":"\"Devoluciones ventas producto Cuero tienda\"&\" \"&Tiendas!B2","v":"Devoluciones ventas producto Cuero tienda A Coruña 1"}]
[{"$f":"\"70800\"&Familias!$A$8&Tiendas!A3","v":"7080012312"},{"$f":"\"Devoluciones ventas producto Cuero tienda\"&\" \"&Tiendas!B3","v":"Devoluciones ventas producto Cuero tienda A Coruña 2"}]
[{"$f":"\"70800\"&Familias!$A$8&Tiendas!A4","v":"7080012313"},{"$f":"\"Devoluciones ventas producto Cuero tienda\"&\" \"&Tiendas!B4","v":"Devoluciones ventas producto Cuero tienda A Coruña 3"}]
[{"$f":"\"70800\"&Familias!$A$8&Tiendas!A5","v":"7080012314"},{"$f":"\"Devoluciones ventas producto Cuero tienda\"&\" \"&Tiendas!B5","v":"Devoluciones ventas producto Cuero tienda A Coruña 4"}]
[{"$f":"\"70800\"&Familias!$A$8&Tiendas!A6","v":"7080012315"},{"$f":"\"Devoluciones ventas producto Cuero tienda\"&\" \"&Tiendas!B6","v":"Devoluciones ventas producto Cuero tienda A Coruña 5"}]
[{"$f":"\"70800\"&Familias!$A$8&Tiendas!A7","v":"7080012321"},{"$f":"\"Devoluciones ventas producto Cuero tienda\"&\" \"&Tiendas!B7","v":"Devoluciones ventas producto Cuero tienda Lugo 1"}]
[{"$f":"\"70800\"&Familias!$A$8&Tiendas!A8","v":"7080012322"},{"$f":"\"Devoluciones ventas producto Cuero tienda\"&\" \"&Tiendas!B8","v":"Devoluciones ventas producto Cuero tienda Lugo 2"}]
[{"$f":"\"70800\"&Familias!$A$8&Tiendas!A9","v":"7080012331"},{"$f":"\"Devoluciones ventas producto Cuero tienda\"&\" \"&Tiendas!B9","v":"Devoluciones ventas producto Cuero tienda Ourense 1"}]
[{"$f":"\"70800\"&Familias!$A$8&Tiendas!A10","v":"7080012332"},{"$f":"\"Devoluciones ventas producto Cuero tienda\"&\" \"&Tiendas!B10","v":"Devoluciones ventas producto Cuero tienda Ourense 2"}]
[{"$f":"\"70800\"&Familias!$A$8&Tiendas!A11","v":"7080012333"},{"$f":"\"Devoluciones ventas producto Cuero tienda\"&\" \"&Tiendas!B11","v":"Devoluciones ventas producto Cuero tienda Ourense 3"}]
[{"$f":"\"70800\"&Familias!$A$8&Tiendas!A12","v":"7080012341"},{"$f":"\"Devoluciones ventas producto Cuero tienda\"&\" \"&Tiendas!B12","v":"Devoluciones ventas producto Cuero tienda Pontevedra 1"}]
[{"$f":"\"70800\"&Familias!$A$8&Tiendas!A13","v":"7080012342"},{"$f":"\"Devoluciones ventas producto Cuero tienda\"&\" \"&Tiendas!B13","v":"Devoluciones ventas producto Cuero tienda Pontevedra 2"}]
[{"$f":"\"70800\"&Familias!$A$8&Tiendas!A14","v":"7080012343"},{"$f":"\"Devoluciones ventas producto Cuero tienda\"&\" \"&Tiendas!B14","v":"Devoluciones ventas producto Cuero tienda Pontevedra 3"}]
[{"$f":"\"70800\"&Familias!$A$8&Tiendas!A15","v":"7080012344"},{"$f":"\"Devoluciones ventas producto Cuero tienda\"&\" \"&Tiendas!B15","v":"Devoluciones ventas producto Cuero tienda Pontevedra 4"}]
[{"$f":"\"70800\"&Familias!$A$8&Tiendas!A16","v":"7080012351"},{"$f":"\"Devoluciones ventas producto Cuero tienda\"&\" \"&Tiendas!B16","v":"Devoluciones ventas producto Cuero tienda Madrid 1"}]
[{"$f":"\"70800\"&Familias!$A$8&Tiendas!A17","v":"7080012352"},{"$f":"\"Devoluciones ventas producto Cuero tienda\"&\" \"&Tiendas!B17","v":"Devoluciones ventas producto Cuero tienda Madrid 2"}]
[{"$f":"\"70800\"&Familias!$A$8&Tiendas!A18","v":"7080012353"},{"$f":"\"Devoluciones ventas producto Cuero tienda\"&\" \"&Tiendas!B18","v":"Devoluciones ventas producto Cuero tienda Madrid 3"}]
[{"$f":"\"70800\"&Familias!$A$8&Tiendas!A19","v":"7080012354"},{"$f":"\"Devoluciones ventas producto Cuero tienda\"&\" \"&Tiendas!B19","v":"Devoluciones ventas producto Cuero tienda Madrid 4"}]
[{"$f":"\"70800\"&Familias!$A$8&Tiendas!A20","v":"7080012355"},{"$f":"\"Devoluciones ventas producto Cuero tienda\"&\" \"&Tiendas!B20","v":"Devoluciones ventas producto Cuero tienda Madrid 5"}]
[{"$f":"\"70800\"&Familias!$A$8&Tiendas!A21","v":"7080012361"},{"$f":"\"Devoluciones ventas producto Cuero tienda\"&\" \"&Tiendas!B21","v":"Devoluciones ventas producto Cuero tienda Barcelona 1"}]
[{"$f":"\"70800\"&Familias!$A$8&Tiendas!A22","v":"7080012362"},{"$f":"\"Devoluciones ventas producto Cuero tienda\"&\" \"&Tiendas!B22","v":"Devoluciones ventas producto Cuero tienda Barcelona 2"}]
[{"$f":"\"70800\"&Familias!$A$8&Tiendas!A23","v":"7080012363"},{"$f":"\"Devoluciones ventas producto Cuero tienda\"&\" \"&Tiendas!B23","v":"Devoluciones ventas producto Cuero tienda Barcelona 3"}]
[{"$f":"\"70800\"&Familias!$A$8&Tiendas!A24","v":"7080012364"},{"$f":"\"Devoluciones ventas producto Cuero tienda\"&\" \"&Tiendas!B24","v":"Devoluciones ventas producto Cuero tienda Barcelona 4"}]
[{"$f":"\"70800\"&Familias!$A$8&Tiendas!A25","v":"7080012371"},{"$f":"\"Devoluciones ventas producto Cuero tienda\"&\" \"&Tiendas!B25","v":"Devoluciones ventas producto Cuero tienda Bilbao 1"}]
[{"$f":"\"70800\"&Familias!$A$8&Tiendas!A26","v":"7080012372"},{"$f":"\"Devoluciones ventas producto Cuero tienda\"&\" \"&Tiendas!B26","v":"Devoluciones ventas producto Cuero tienda Bilbao 2"}]
[{"$f":"\"70800\"&Familias!$A$8&Tiendas!A27","v":"7080012380"},{"$f":"\"Devoluciones ventas producto Cuero tienda\"&\" \"&Tiendas!B27","v":"Devoluciones ventas producto Cuero tienda Almacén"}]
[7081,"DEVOLUCIONES DE VENTAS DE PRODUCTOS TERMINADOS"]
[7082,"DEVOLUCIONES DE VENTAS DE PRODUCTOS SEMITERMINADOS"]
[7083,"DEVOLUCIONES DE VENTAS DE SUBPRODUCTOS Y RESIDUOS"]
[7084,"DEVOLUCIONES DE VENTAS DE ENVASES Y EMBALAJES"]
[709,"RAPPELS SOBRE VENTAS"]
[7090,"RAPPELS SOBRE VENTAS DE MERCADERÍAS"]
[{"$f":"\"70900\"&Familias!A3","v":"70900111"},"Rappels sobre ventas producto Mar"]
[{"$f":"$A$1861&Tiendas!A2","v":"7090011111"},{"$f":"$B$1861&\" \"&\"tienda\"&\" \"&Tiendas!B2","v":"Rappels sobre ventas producto Mar tienda A Coruña 1"}]
[{"$f":"$A$1861&Tiendas!A3","v":"7090011112"},{"$f":"$B$1861&\" \"&\"tienda\"&\" \"&Tiendas!B3","v":"Rappels sobre ventas producto Mar tienda A Coruña 2"}]
[{"$f":"$A$1861&Tiendas!A4","v":"7090011113"},{"$f":"$B$1861&\" \"&\"tienda\"&\" \"&Tiendas!B4","v":"Rappels sobre ventas producto Mar tienda A Coruña 3"}]
[{"$f":"$A$1861&Tiendas!A5","v":"7090011114"},{"$f":"$B$1861&\" \"&\"tienda\"&\" \"&Tiendas!B5","v":"Rappels sobre ventas producto Mar tienda A Coruña 4"}]
[{"$f":"$A$1861&Tiendas!A6","v":"7090011115"},{"$f":"$B$1861&\" \"&\"tienda\"&\" \"&Tiendas!B6","v":"Rappels sobre ventas producto Mar tienda A Coruña 5"}]
[{"$f":"$A$1861&Tiendas!A7","v":"7090011121"},{"$f":"$B$1861&\" \"&\"tienda\"&\" \"&Tiendas!B7","v":"Rappels sobre ventas producto Mar tienda Lugo 1"}]
[{"$f":"$A$1861&Tiendas!A8","v":"7090011122"},{"$f":"$B$1861&\" \"&\"tienda\"&\" \"&Tiendas!B8","v":"Rappels sobre ventas producto Mar tienda Lugo 2"}]
[{"$f":"$A$1861&Tiendas!A9","v":"7090011131"},{"$f":"$B$1861&\" \"&\"tienda\"&\" \"&Tiendas!B9","v":"Rappels sobre ventas producto Mar tienda Ourense 1"}]
[{"$f":"$A$1861&Tiendas!A10","v":"7090011132"},{"$f":"$B$1861&\" \"&\"tienda\"&\" \"&Tiendas!B10","v":"Rappels sobre ventas producto Mar tienda Ourense 2"}]
[{"$f":"$A$1861&Tiendas!A11","v":"7090011133"},{"$f":"$B$1861&\" \"&\"tienda\"&\" \"&Tiendas!B11","v":"Rappels sobre ventas producto Mar tienda Ourense 3"}]
[{"$f":"$A$1861&Tiendas!A12","v":"7090011141"},{"$f":"$B$1861&\" \"&\"tienda\"&\" \"&Tiendas!B12","v":"Rappels sobre ventas producto Mar tienda Pontevedra 1"}]
[{"$f":"$A$1861&Tiendas!A13","v":"7090011142"},{"$f":"$B$1861&\" \"&\"tienda\"&\" \"&Tiendas!B13","v":"Rappels sobre ventas producto Mar tienda Pontevedra 2"}]
[{"$f":"$A$1861&Tiendas!A14","v":"7090011143"},{"$f":"$B$1861&\" \"&\"tienda\"&\" \"&Tiendas!B14","v":"Rappels sobre ventas producto Mar tienda Pontevedra 3"}]
[{"$f":"$A$1861&Tiendas!A15","v":"7090011144"},{"$f":"$B$1861&\" \"&\"tienda\"&\" \"&Tiendas!B15","v":"Rappels sobre ventas producto Mar tienda Pontevedra 4"}]
[{"$f":"$A$1861&Tiendas!A16","v":"7090011151"},{"$f":"$B$1861&\" \"&\"tienda\"&\" \"&Tiendas!B16","v":"Rappels sobre ventas producto Mar tienda Madrid 1"}]
[{"$f":"$A$1861&Tiendas!A17","v":"7090011152"},{"$f":"$B$1861&\" \"&\"tienda\"&\" \"&Tiendas!B17","v":"Rappels sobre ventas producto Mar tienda Madrid 2"}]
[{"$f":"$A$1861&Tiendas!A18","v":"7090011153"},{"$f":"$B$1861&\" \"&\"tienda\"&\" \"&Tiendas!B18","v":"Rappels sobre ventas producto Mar tienda Madrid 3"}]
[{"$f":"$A$1861&Tiendas!A19","v":"7090011154"},{"$f":"$B$1861&\" \"&\"tienda\"&\" \"&Tiendas!B19","v":"Rappels sobre ventas producto Mar tienda Madrid 4"}]
[{"$f":"$A$1861&Tiendas!A20","v":"7090011155"},{"$f":"$B$1861&\" \"&\"tienda\"&\" \"&Tiendas!B20","v":"Rappels sobre ventas producto Mar tienda Madrid 5"}]
[{"$f":"$A$1861&Tiendas!A21","v":"7090011161"},{"$f":"$B$1861&\" \"&\"tienda\"&\" \"&Tiendas!B21","v":"Rappels sobre ventas producto Mar tienda Barcelona 1"}]
[{"$f":"$A$1861&Tiendas!A22","v":"7090011162"},{"$f":"$B$1861&\" \"&\"tienda\"&\" \"&Tiendas!B22","v":"Rappels sobre ventas producto Mar tienda Barcelona 2"}]
[{"$f":"$A$1861&Tiendas!A23","v":"7090011163"},{"$f":"$B$1861&\" \"&\"tienda\"&\" \"&Tiendas!B23","v":"Rappels sobre ventas producto Mar tienda Barcelona 3"}]
[{"$f":"$A$1861&Tiendas!A24","v":"7090011164"},{"$f":"$B$1861&\" \"&\"tienda\"&\" \"&Tiendas!B24","v":"Rappels sobre ventas producto Mar tienda Barcelona 4"}]
[{"$f":"$A$1861&Tiendas!A25","v":"7090011171"},{"$f":"$B$1861&\" \"&\"tienda\"&\" \"&Tiendas!B25","v":"Rappels sobre ventas producto Mar tienda Bilbao 1"}]
[{"$f":"$A$1861&Tiendas!A26","v":"7090011172"},{"$f":"$B$1861&\" \"&\"tienda\"&\" \"&Tiendas!B26","v":"Rappels sobre ventas producto Mar tienda Bilbao 2"}]
[{"$f":"$A$1861&Tiendas!A27","v":"7090011180"},{"$f":"$B$1861&\" \"&\"tienda\"&\" \"&Tiendas!B27","v":"Rappels sobre ventas producto Mar tienda Almacén"}]
[{"$f":"\"70900\"&Familias!A4","v":"70900112"},{"$f":"\"Rappels sobre ventas producto Campo \"","v":"Rappels sobre ventas producto Campo "}]
[{"$f":"$A$1888&Tiendas!A2","v":"7090011211"},{"$f":"$B$1888&\" \"&\"tienda\"&\" \"&Tiendas!B2","v":"Rappels sobre ventas producto Campo  tienda A Coruña 1"}]
[{"$f":"$A$1888&Tiendas!A3","v":"7090011212"},{"$f":"$B$1888&\" \"&\"tienda\"&\" \"&Tiendas!B3","v":"Rappels sobre ventas producto Campo  tienda A Coruña 2"}]
[{"$f":"$A$1888&Tiendas!A4","v":"7090011213"},{"$f":"$B$1888&\" \"&\"tienda\"&\" \"&Tiendas!B4","v":"Rappels sobre ventas producto Campo  tienda A Coruña 3"}]
[{"$f":"$A$1888&Tiendas!A5","v":"7090011214"},{"$f":"$B$1888&\" \"&\"tienda\"&\" \"&Tiendas!B5","v":"Rappels sobre ventas producto Campo  tienda A Coruña 4"}]
[{"$f":"$A$1888&Tiendas!A6","v":"7090011215"},{"$f":"$B$1888&\" \"&\"tienda\"&\" \"&Tiendas!B6","v":"Rappels sobre ventas producto Campo  tienda A Coruña 5"}]
[{"$f":"$A$1888&Tiendas!A7","v":"7090011221"},{"$f":"$B$1888&\" \"&\"tienda\"&\" \"&Tiendas!B7","v":"Rappels sobre ventas producto Campo  tienda Lugo 1"}]
[{"$f":"$A$1888&Tiendas!A8","v":"7090011222"},{"$f":"$B$1888&\" \"&\"tienda\"&\" \"&Tiendas!B8","v":"Rappels sobre ventas producto Campo  tienda Lugo 2"}]
[{"$f":"$A$1888&Tiendas!A9","v":"7090011231"},{"$f":"$B$1888&\" \"&\"tienda\"&\" \"&Tiendas!B9","v":"Rappels sobre ventas producto Campo  tienda Ourense 1"}]
[{"$f":"$A$1888&Tiendas!A10","v":"7090011232"},{"$f":"$B$1888&\" \"&\"tienda\"&\" \"&Tiendas!B10","v":"Rappels sobre ventas producto Campo  tienda Ourense 2"}]
[{"$f":"$A$1888&Tiendas!A11","v":"7090011233"},{"$f":"$B$1888&\" \"&\"tienda\"&\" \"&Tiendas!B11","v":"Rappels sobre ventas producto Campo  tienda Ourense 3"}]
[{"$f":"$A$1888&Tiendas!A12","v":"7090011241"},{"$f":"$B$1888&\" \"&\"tienda\"&\" \"&Tiendas!B12","v":"Rappels sobre ventas producto Campo  tienda Pontevedra 1"}]
[{"$f":"$A$1888&Tiendas!A13","v":"7090011242"},{"$f":"$B$1888&\" \"&\"tienda\"&\" \"&Tiendas!B13","v":"Rappels sobre ventas producto Campo  tienda Pontevedra 2"}]
[{"$f":"$A$1888&Tiendas!A14","v":"7090011243"},{"$f":"$B$1888&\" \"&\"tienda\"&\" \"&Tiendas!B14","v":"Rappels sobre ventas producto Campo  tienda Pontevedra 3"}]
[{"$f":"$A$1888&Tiendas!A15","v":"7090011244"},{"$f":"$B$1888&\" \"&\"tienda\"&\" \"&Tiendas!B15","v":"Rappels sobre ventas producto Campo  tienda Pontevedra 4"}]
[{"$f":"$A$1888&Tiendas!A16","v":"7090011251"},{"$f":"$B$1888&\" \"&\"tienda\"&\" \"&Tiendas!B16","v":"Rappels sobre ventas producto Campo  tienda Madrid 1"}]
[{"$f":"$A$1888&Tiendas!A17","v":"7090011252"},{"$f":"$B$1888&\" \"&\"tienda\"&\" \"&Tiendas!B17","v":"Rappels sobre ventas producto Campo  tienda Madrid 2"}]
[{"$f":"$A$1888&Tiendas!A18","v":"7090011253"},{"$f":"$B$1888&\" \"&\"tienda\"&\" \"&Tiendas!B18","v":"Rappels sobre ventas producto Campo  tienda Madrid 3"}]
[{"$f":"$A$1888&Tiendas!A19","v":"7090011254"},{"$f":"$B$1888&\" \"&\"tienda\"&\" \"&Tiendas!B19","v":"Rappels sobre ventas producto Campo  tienda Madrid 4"}]
[{"$f":"$A$1888&Tiendas!A20","v":"7090011255"},{"$f":"$B$1888&\" \"&\"tienda\"&\" \"&Tiendas!B20","v":"Rappels sobre ventas producto Campo  tienda Madrid 5"}]
[{"$f":"$A$1888&Tiendas!A21","v":"7090011261"},{"$f":"$B$1888&\" \"&\"tienda\"&\" \"&Tiendas!B21","v":"Rappels sobre ventas producto Campo  tienda Barcelona 1"}]
[{"$f":"$A$1888&Tiendas!A22","v":"7090011262"},{"$f":"$B$1888&\" \"&\"tienda\"&\" \"&Tiendas!B22","v":"Rappels sobre ventas producto Campo  tienda Barcelona 2"}]
[{"$f":"$A$1888&Tiendas!A23","v":"7090011263"},{"$f":"$B$1888&\" \"&\"tienda\"&\" \"&Tiendas!B23","v":"Rappels sobre ventas producto Campo  tienda Barcelona 3"}]
[{"$f":"$A$1888&Tiendas!A24","v":"7090011264"},{"$f":"$B$1888&\" \"&\"tienda\"&\" \"&Tiendas!B24","v":"Rappels sobre ventas producto Campo  tienda Barcelona 4"}]
[{"$f":"$A$1888&Tiendas!A25","v":"7090011271"},{"$f":"$B$1888&\" \"&\"tienda\"&\" \"&Tiendas!B25","v":"Rappels sobre ventas producto Campo  tienda Bilbao 1"}]
[{"$f":"$A$1888&Tiendas!A26","v":"7090011272"},{"$f":"$B$1888&\" \"&\"tienda\"&\" \"&Tiendas!B26","v":"Rappels sobre ventas producto Campo  tienda Bilbao 2"}]
[{"$f":"$A$1888&Tiendas!A27","v":"7090011280"},{"$f":"$B$1888&\" \"&\"tienda\"&\" \"&Tiendas!B27","v":"Rappels sobre ventas producto Campo  tienda Almacén"}]
[{"$f":"\"70900\"&Familias!A5","v":"70900113"},{"$f":"\"Rappels sobre ventas producto Bebidas\"","v":"Rappels sobre ventas producto Bebidas"}]
[{"$f":"$A$1915&Tiendas!A2","v":"7090011311"},{"$f":"$B$1915&\" \"&\"tienda\"&\" \"&Tiendas!B2","v":"Rappels sobre ventas producto Bebidas tienda A Coruña 1"}]
[{"$f":"$A$1915&Tiendas!A3","v":"7090011312"},{"$f":"$B$1915&\" \"&\"tienda\"&\" \"&Tiendas!B3","v":"Rappels sobre ventas producto Bebidas tienda A Coruña 2"}]
[{"$f":"$A$1915&Tiendas!A4","v":"7090011313"},{"$f":"$B$1915&\" \"&\"tienda\"&\" \"&Tiendas!B4","v":"Rappels sobre ventas producto Bebidas tienda A Coruña 3"}]
[{"$f":"$A$1915&Tiendas!A5","v":"7090011314"},{"$f":"$B$1915&\" \"&\"tienda\"&\" \"&Tiendas!B5","v":"Rappels sobre ventas producto Bebidas tienda A Coruña 4"}]
[{"$f":"$A$1915&Tiendas!A6","v":"7090011315"},{"$f":"$B$1915&\" \"&\"tienda\"&\" \"&Tiendas!B6","v":"Rappels sobre ventas producto Bebidas tienda A Coruña 5"}]
[{"$f":"$A$1915&Tiendas!A7","v":"7090011321"},{"$f":"$B$1915&\" \"&\"tienda\"&\" \"&Tiendas!B7","v":"Rappels sobre ventas producto Bebidas tienda Lugo 1"}]
[{"$f":"$A$1915&Tiendas!A8","v":"7090011322"},{"$f":"$B$1915&\" \"&\"tienda\"&\" \"&Tiendas!B8","v":"Rappels sobre ventas producto Bebidas tienda Lugo 2"}]
[{"$f":"$A$1915&Tiendas!A9","v":"7090011331"},{"$f":"$B$1915&\" \"&\"tienda\"&\" \"&Tiendas!B9","v":"Rappels sobre ventas producto Bebidas tienda Ourense 1"}]
[{"$f":"$A$1915&Tiendas!A10","v":"7090011332"},{"$f":"$B$1915&\" \"&\"tienda\"&\" \"&Tiendas!B10","v":"Rappels sobre ventas producto Bebidas tienda Ourense 2"}]
[{"$f":"$A$1915&Tiendas!A11","v":"7090011333"},{"$f":"$B$1915&\" \"&\"tienda\"&\" \"&Tiendas!B11","v":"Rappels sobre ventas producto Bebidas tienda Ourense 3"}]
[{"$f":"$A$1915&Tiendas!A12","v":"7090011341"},{"$f":"$B$1915&\" \"&\"tienda\"&\" \"&Tiendas!B12","v":"Rappels sobre ventas producto Bebidas tienda Pontevedra 1"}]
[{"$f":"$A$1915&Tiendas!A13","v":"7090011342"},{"$f":"$B$1915&\" \"&\"tienda\"&\" \"&Tiendas!B13","v":"Rappels sobre ventas producto Bebidas tienda Pontevedra 2"}]
[{"$f":"$A$1915&Tiendas!A14","v":"7090011343"},{"$f":"$B$1915&\" \"&\"tienda\"&\" \"&Tiendas!B14","v":"Rappels sobre ventas producto Bebidas tienda Pontevedra 3"}]
[{"$f":"$A$1915&Tiendas!A15","v":"7090011344"},{"$f":"$B$1915&\" \"&\"tienda\"&\" \"&Tiendas!B15","v":"Rappels sobre ventas producto Bebidas tienda Pontevedra 4"}]
[{"$f":"$A$1915&Tiendas!A16","v":"7090011351"},{"$f":"$B$1915&\" \"&\"tienda\"&\" \"&Tiendas!B16","v":"Rappels sobre ventas producto Bebidas tienda Madrid 1"}]
[{"$f":"$A$1915&Tiendas!A17","v":"7090011352"},{"$f":"$B$1915&\" \"&\"tienda\"&\" \"&Tiendas!B17","v":"Rappels sobre ventas producto Bebidas tienda Madrid 2"}]
[{"$f":"$A$1915&Tiendas!A18","v":"7090011353"},{"$f":"$B$1915&\" \"&\"tienda\"&\" \"&Tiendas!B18","v":"Rappels sobre ventas producto Bebidas tienda Madrid 3"}]
[{"$f":"$A$1915&Tiendas!A19","v":"7090011354"},{"$f":"$B$1915&\" \"&\"tienda\"&\" \"&Tiendas!B19","v":"Rappels sobre ventas producto Bebidas tienda Madrid 4"}]
[{"$f":"$A$1915&Tiendas!A20","v":"7090011355"},{"$f":"$B$1915&\" \"&\"tienda\"&\" \"&Tiendas!B20","v":"Rappels sobre ventas producto Bebidas tienda Madrid 5"}]
[{"$f":"$A$1915&Tiendas!A21","v":"7090011361"},{"$f":"$B$1915&\" \"&\"tienda\"&\" \"&Tiendas!B21","v":"Rappels sobre ventas producto Bebidas tienda Barcelona 1"}]
[{"$f":"$A$1915&Tiendas!A22","v":"7090011362"},{"$f":"$B$1915&\" \"&\"tienda\"&\" \"&Tiendas!B22","v":"Rappels sobre ventas producto Bebidas tienda Barcelona 2"}]
[{"$f":"$A$1915&Tiendas!A23","v":"7090011363"},{"$f":"$B$1915&\" \"&\"tienda\"&\" \"&Tiendas!B23","v":"Rappels sobre ventas producto Bebidas tienda Barcelona 3"}]
[{"$f":"$A$1915&Tiendas!A24","v":"7090011364"},{"$f":"$B$1915&\" \"&\"tienda\"&\" \"&Tiendas!B24","v":"Rappels sobre ventas producto Bebidas tienda Barcelona 4"}]
[{"$f":"$A$1915&Tiendas!A25","v":"7090011371"},{"$f":"$B$1915&\" \"&\"tienda\"&\" \"&Tiendas!B25","v":"Rappels sobre ventas producto Bebidas tienda Bilbao 1"}]
[{"$f":"$A$1915&Tiendas!A26","v":"7090011372"},{"$f":"$B$1915&\" \"&\"tienda\"&\" \"&Tiendas!B26","v":"Rappels sobre ventas producto Bebidas tienda Bilbao 2"}]
[{"$f":"$A$1915&Tiendas!A27","v":"7090011380"},{"$f":"$B$1915&\" \"&\"tienda\"&\" \"&Tiendas!B27","v":"Rappels sobre ventas producto Bebidas tienda Almacén"}]
[{"$f":"\"70900\"&Familias!A6","v":"70900121"},{"$f":"\"Rappels sobre ventas producto Cerámicas\"","v":"Rappels sobre ventas producto Cerámicas"}]
[{"$f":"$A$1942&Tiendas!A2","v":"7090012111"},{"$f":"$B$1942&\" \"&\"tienda\"&\" \"&Tiendas!B2","v":"Rappels sobre ventas producto Cerámicas tienda A Coruña 1"}]
[{"$f":"$A$1942&Tiendas!A3","v":"7090012112"},{"$f":"$B$1942&\" \"&\"tienda\"&\" \"&Tiendas!B3","v":"Rappels sobre ventas producto Cerámicas tienda A Coruña 2"}]
[{"$f":"$A$1942&Tiendas!A4","v":"7090012113"},{"$f":"$B$1942&\" \"&\"tienda\"&\" \"&Tiendas!B4","v":"Rappels sobre ventas producto Cerámicas tienda A Coruña 3"}]
[{"$f":"$A$1942&Tiendas!A5","v":"7090012114"},{"$f":"$B$1942&\" \"&\"tienda\"&\" \"&Tiendas!B5","v":"Rappels sobre ventas producto Cerámicas tienda A Coruña 4"}]
[{"$f":"$A$1942&Tiendas!A6","v":"7090012115"},{"$f":"$B$1942&\" \"&\"tienda\"&\" \"&Tiendas!B6","v":"Rappels sobre ventas producto Cerámicas tienda A Coruña 5"}]
[{"$f":"$A$1942&Tiendas!A7","v":"7090012121"},{"$f":"$B$1942&\" \"&\"tienda\"&\" \"&Tiendas!B7","v":"Rappels sobre ventas producto Cerámicas tienda Lugo 1"}]
[{"$f":"$A$1942&Tiendas!A8","v":"7090012122"},{"$f":"$B$1942&\" \"&\"tienda\"&\" \"&Tiendas!B8","v":"Rappels sobre ventas producto Cerámicas tienda Lugo 2"}]
[{"$f":"$A$1942&Tiendas!A9","v":"7090012131"},{"$f":"$B$1942&\" \"&\"tienda\"&\" \"&Tiendas!B9","v":"Rappels sobre ventas producto Cerámicas tienda Ourense 1"}]
[{"$f":"$A$1942&Tiendas!A10","v":"7090012132"},{"$f":"$B$1942&\" \"&\"tienda\"&\" \"&Tiendas!B10","v":"Rappels sobre ventas producto Cerámicas tienda Ourense 2"}]
[{"$f":"$A$1942&Tiendas!A11","v":"7090012133"},{"$f":"$B$1942&\" \"&\"tienda\"&\" \"&Tiendas!B11","v":"Rappels sobre ventas producto Cerámicas tienda Ourense 3"}]
[{"$f":"$A$1942&Tiendas!A12","v":"7090012141"},{"$f":"$B$1942&\" \"&\"tienda\"&\" \"&Tiendas!B12","v":"Rappels sobre ventas producto Cerámicas tienda Pontevedra 1"}]
[{"$f":"$A$1942&Tiendas!A13","v":"7090012142"},{"$f":"$B$1942&\" \"&\"tienda\"&\" \"&Tiendas!B13","v":"Rappels sobre ventas producto Cerámicas tienda Pontevedra 2"}]
[{"$f":"$A$1942&Tiendas!A14","v":"7090012143"},{"$f":"$B$1942&\" \"&\"tienda\"&\" \"&Tiendas!B14","v":"Rappels sobre ventas producto Cerámicas tienda Pontevedra 3"}]
[{"$f":"$A$1942&Tiendas!A15","v":"7090012144"},{"$f":"$B$1942&\" \"&\"tienda\"&\" \"&Tiendas!B15","v":"Rappels sobre ventas producto Cerámicas tienda Pontevedra 4"}]
[{"$f":"$A$1942&Tiendas!A16","v":"7090012151"},{"$f":"$B$1942&\" \"&\"tienda\"&\" \"&Tiendas!B16","v":"Rappels sobre ventas producto Cerámicas tienda Madrid 1"}]
[{"$f":"$A$1942&Tiendas!A17","v":"7090012152"},{"$f":"$B$1942&\" \"&\"tienda\"&\" \"&Tiendas!B17","v":"Rappels sobre ventas producto Cerámicas tienda Madrid 2"}]
[{"$f":"$A$1942&Tiendas!A18","v":"7090012153"},{"$f":"$B$1942&\" \"&\"tienda\"&\" \"&Tiendas!B18","v":"Rappels sobre ventas producto Cerámicas tienda Madrid 3"}]
[{"$f":"$A$1942&Tiendas!A19","v":"7090012154"},{"$f":"$B$1942&\" \"&\"tienda\"&\" \"&Tiendas!B19","v":"Rappels sobre ventas producto Cerámicas tienda Madrid 4"}]
[{"$f":"$A$1942&Tiendas!A20","v":"7090012155"},{"$f":"$B$1942&\" \"&\"tienda\"&\" \"&Tiendas!B20","v":"Rappels sobre ventas producto Cerámicas tienda Madrid 5"}]
[{"$f":"$A$1942&Tiendas!A21","v":"7090012161"},{"$f":"$B$1942&\" \"&\"tienda\"&\" \"&Tiendas!B21","v":"Rappels sobre ventas producto Cerámicas tienda Barcelona 1"}]
[{"$f":"$A$1942&Tiendas!A22","v":"7090012162"},{"$f":"$B$1942&\" \"&\"tienda\"&\" \"&Tiendas!B22","v":"Rappels sobre ventas producto Cerámicas tienda Barcelona 2"}]
[{"$f":"$A$1942&Tiendas!A23","v":"7090012163"},{"$f":"$B$1942&\" \"&\"tienda\"&\" \"&Tiendas!B23","v":"Rappels sobre ventas producto Cerámicas tienda Barcelona 3"}]
[{"$f":"$A$1942&Tiendas!A24","v":"7090012164"},{"$f":"$B$1942&\" \"&\"tienda\"&\" \"&Tiendas!B24","v":"Rappels sobre ventas producto Cerámicas tienda Barcelona 4"}]
[{"$f":"$A$1942&Tiendas!A25","v":"7090012171"},{"$f":"$B$1942&\" \"&\"tienda\"&\" \"&Tiendas!B25","v":"Rappels sobre ventas producto Cerámicas tienda Bilbao 1"}]
[{"$f":"$A$1942&Tiendas!A26","v":"7090012172"},{"$f":"$B$1942&\" \"&\"tienda\"&\" \"&Tiendas!B26","v":"Rappels sobre ventas producto Cerámicas tienda Bilbao 2"}]
[{"$f":"$A$1942&Tiendas!A27","v":"7090012180"},{"$f":"$B$1942&\" \"&\"tienda\"&\" \"&Tiendas!B27","v":"Rappels sobre ventas producto Cerámicas tienda Almacén"}]
[{"$f":"\"70900\"&Familias!A7","v":"70900122"},{"$f":"\"Rappels sobre ventas producto Encaje\"","v":"Rappels sobre ventas producto Encaje"}]
[{"$f":"$A$1969&Tiendas!A2","v":"7090012211"},{"$f":"$B$1969&\" \"&\"tienda\"&\" \"&Tiendas!B2","v":"Rappels sobre ventas producto Encaje tienda A Coruña 1"}]
[{"$f":"$A$1969&Tiendas!A3","v":"7090012212"},{"$f":"$B$1969&\" \"&\"tienda\"&\" \"&Tiendas!B3","v":"Rappels sobre ventas producto Encaje tienda A Coruña 2"}]
[{"$f":"$A$1969&Tiendas!A4","v":"7090012213"},{"$f":"$B$1969&\" \"&\"tienda\"&\" \"&Tiendas!B4","v":"Rappels sobre ventas producto Encaje tienda A Coruña 3"}]
[{"$f":"$A$1969&Tiendas!A5","v":"7090012214"},{"$f":"$B$1969&\" \"&\"tienda\"&\" \"&Tiendas!B5","v":"Rappels sobre ventas producto Encaje tienda A Coruña 4"}]
[{"$f":"$A$1969&Tiendas!A6","v":"7090012215"},{"$f":"$B$1969&\" \"&\"tienda\"&\" \"&Tiendas!B6","v":"Rappels sobre ventas producto Encaje tienda A Coruña 5"}]
[{"$f":"$A$1969&Tiendas!A7","v":"7090012221"},{"$f":"$B$1969&\" \"&\"tienda\"&\" \"&Tiendas!B7","v":"Rappels sobre ventas producto Encaje tienda Lugo 1"}]
[{"$f":"$A$1969&Tiendas!A8","v":"7090012222"},{"$f":"$B$1969&\" \"&\"tienda\"&\" \"&Tiendas!B8","v":"Rappels sobre ventas producto Encaje tienda Lugo 2"}]
[{"$f":"$A$1969&Tiendas!A9","v":"7090012231"},{"$f":"$B$1969&\" \"&\"tienda\"&\" \"&Tiendas!B9","v":"Rappels sobre ventas producto Encaje tienda Ourense 1"}]
[{"$f":"$A$1969&Tiendas!A10","v":"7090012232"},{"$f":"$B$1969&\" \"&\"tienda\"&\" \"&Tiendas!B10","v":"Rappels sobre ventas producto Encaje tienda Ourense 2"}]
[{"$f":"$A$1969&Tiendas!A11","v":"7090012233"},{"$f":"$B$1969&\" \"&\"tienda\"&\" \"&Tiendas!B11","v":"Rappels sobre ventas producto Encaje tienda Ourense 3"}]
[{"$f":"$A$1969&Tiendas!A12","v":"7090012241"},{"$f":"$B$1969&\" \"&\"tienda\"&\" \"&Tiendas!B12","v":"Rappels sobre ventas producto Encaje tienda Pontevedra 1"}]
[{"$f":"$A$1969&Tiendas!A13","v":"7090012242"},{"$f":"$B$1969&\" \"&\"tienda\"&\" \"&Tiendas!B13","v":"Rappels sobre ventas producto Encaje tienda Pontevedra 2"}]
[{"$f":"$A$1969&Tiendas!A14","v":"7090012243"},{"$f":"$B$1969&\" \"&\"tienda\"&\" \"&Tiendas!B14","v":"Rappels sobre ventas producto Encaje tienda Pontevedra 3"}]
[{"$f":"$A$1969&Tiendas!A15","v":"7090012244"},{"$f":"$B$1969&\" \"&\"tienda\"&\" \"&Tiendas!B15","v":"Rappels sobre ventas producto Encaje tienda Pontevedra 4"}]
[{"$f":"$A$1969&Tiendas!A16","v":"7090012251"},{"$f":"$B$1969&\" \"&\"tienda\"&\" \"&Tiendas!B16","v":"Rappels sobre ventas producto Encaje tienda Madrid 1"}]
[{"$f":"$A$1969&Tiendas!A17","v":"7090012252"},{"$f":"$B$1969&\" \"&\"tienda\"&\" \"&Tiendas!B17","v":"Rappels sobre ventas producto Encaje tienda Madrid 2"}]
[{"$f":"$A$1969&Tiendas!A18","v":"7090012253"},{"$f":"$B$1969&\" \"&\"tienda\"&\" \"&Tiendas!B18","v":"Rappels sobre ventas producto Encaje tienda Madrid 3"}]
[{"$f":"$A$1969&Tiendas!A19","v":"7090012254"},{"$f":"$B$1969&\" \"&\"tienda\"&\" \"&Tiendas!B19","v":"Rappels sobre ventas producto Encaje tienda Madrid 4"}]
[{"$f":"$A$1969&Tiendas!A20","v":"7090012255"},{"$f":"$B$1969&\" \"&\"tienda\"&\" \"&Tiendas!B20","v":"Rappels sobre ventas producto Encaje tienda Madrid 5"}]
[{"$f":"$A$1969&Tiendas!A21","v":"7090012261"},{"$f":"$B$1969&\" \"&\"tienda\"&\" \"&Tiendas!B21","v":"Rappels sobre ventas producto Encaje tienda Barcelona 1"}]
[{"$f":"$A$1969&Tiendas!A22","v":"7090012262"},{"$f":"$B$1969&\" \"&\"tienda\"&\" \"&Tiendas!B22","v":"Rappels sobre ventas producto Encaje tienda Barcelona 2"}]
[{"$f":"$A$1969&Tiendas!A23","v":"7090012263"},{"$f":"$B$1969&\" \"&\"tienda\"&\" \"&Tiendas!B23","v":"Rappels sobre ventas producto Encaje tienda Barcelona 3"}]
[{"$f":"$A$1969&Tiendas!A24","v":"7090012264"},{"$f":"$B$1969&\" \"&\"tienda\"&\" \"&Tiendas!B24","v":"Rappels sobre ventas producto Encaje tienda Barcelona 4"}]
[{"$f":"$A$1969&Tiendas!A25","v":"7090012271"},{"$f":"$B$1969&\" \"&\"tienda\"&\" \"&Tiendas!B25","v":"Rappels sobre ventas producto Encaje tienda Bilbao 1"}]
[{"$f":"$A$1969&Tiendas!A26","v":"7090012272"},{"$f":"$B$1969&\" \"&\"tienda\"&\" \"&Tiendas!B26","v":"Rappels sobre ventas producto Encaje tienda Bilbao 2"}]
[{"$f":"$A$1969&Tiendas!A27","v":"7090012280"},{"$f":"$B$1969&\" \"&\"tienda\"&\" \"&Tiendas!B27","v":"Rappels sobre ventas producto Encaje tienda Almacén"}]
[{"$f":"\"70900\"&Familias!A8","v":"70900123"},{"$f":"\"Rappels sobre ventas producto Cuero\"","v":"Rappels sobre ventas producto Cuero"}]
[{"$f":"$A$1996&Tiendas!A2","v":"7090012311"},{"$f":"$B$1996&\" \"&\"tienda\"&\" \"&Tiendas!B2","v":"Rappels sobre ventas producto Cuero tienda A Coruña 1"}]
[{"$f":"$A$1996&Tiendas!A3","v":"7090012312"},{"$f":"$B$1996&\" \"&\"tienda\"&\" \"&Tiendas!B3","v":"Rappels sobre ventas producto Cuero tienda A Coruña 2"}]
[{"$f":"$A$1996&Tiendas!A4","v":"7090012313"},{"$f":"$B$1996&\" \"&\"tienda\"&\" \"&Tiendas!B4","v":"Rappels sobre ventas producto Cuero tienda A Coruña 3"}]
[{"$f":"$A$1996&Tiendas!A5","v":"7090012314"},{"$f":"$B$1996&\" \"&\"tienda\"&\" \"&Tiendas!B5","v":"Rappels sobre ventas producto Cuero tienda A Coruña 4"}]
[{"$f":"$A$1996&Tiendas!A6","v":"7090012315"},{"$f":"$B$1996&\" \"&\"tienda\"&\" \"&Tiendas!B6","v":"Rappels sobre ventas producto Cuero tienda A Coruña 5"}]
[{"$f":"$A$1996&Tiendas!A7","v":"7090012321"},{"$f":"$B$1996&\" \"&\"tienda\"&\" \"&Tiendas!B7","v":"Rappels sobre ventas producto Cuero tienda Lugo 1"}]
[{"$f":"$A$1996&Tiendas!A8","v":"7090012322"},{"$f":"$B$1996&\" \"&\"tienda\"&\" \"&Tiendas!B8","v":"Rappels sobre ventas producto Cuero tienda Lugo 2"}]
[{"$f":"$A$1996&Tiendas!A9","v":"7090012331"},{"$f":"$B$1996&\" \"&\"tienda\"&\" \"&Tiendas!B9","v":"Rappels sobre ventas producto Cuero tienda Ourense 1"}]
[{"$f":"$A$1996&Tiendas!A10","v":"7090012332"},{"$f":"$B$1996&\" \"&\"tienda\"&\" \"&Tiendas!B10","v":"Rappels sobre ventas producto Cuero tienda Ourense 2"}]
[{"$f":"$A$1996&Tiendas!A11","v":"7090012333"},{"$f":"$B$1996&\" \"&\"tienda\"&\" \"&Tiendas!B11","v":"Rappels sobre ventas producto Cuero tienda Ourense 3"}]
[{"$f":"$A$1996&Tiendas!A12","v":"7090012341"},{"$f":"$B$1996&\" \"&\"tienda\"&\" \"&Tiendas!B12","v":"Rappels sobre ventas producto Cuero tienda Pontevedra 1"}]
[{"$f":"$A$1996&Tiendas!A13","v":"7090012342"},{"$f":"$B$1996&\" \"&\"tienda\"&\" \"&Tiendas!B13","v":"Rappels sobre ventas producto Cuero tienda Pontevedra 2"}]
[{"$f":"$A$1996&Tiendas!A14","v":"7090012343"},{"$f":"$B$1996&\" \"&\"tienda\"&\" \"&Tiendas!B14","v":"Rappels sobre ventas producto Cuero tienda Pontevedra 3"}]
[{"$f":"$A$1996&Tiendas!A15","v":"7090012344"},{"$f":"$B$1996&\" \"&\"tienda\"&\" \"&Tiendas!B15","v":"Rappels sobre ventas producto Cuero tienda Pontevedra 4"}]
[{"$f":"$A$1996&Tiendas!A16","v":"7090012351"},{"$f":"$B$1996&\" \"&\"tienda\"&\" \"&Tiendas!B16","v":"Rappels sobre ventas producto Cuero tienda Madrid 1"}]
[{"$f":"$A$1996&Tiendas!A17","v":"7090012352"},{"$f":"$B$1996&\" \"&\"tienda\"&\" \"&Tiendas!B17","v":"Rappels sobre ventas producto Cuero tienda Madrid 2"}]
[{"$f":"$A$1996&Tiendas!A18","v":"7090012353"},{"$f":"$B$1996&\" \"&\"tienda\"&\" \"&Tiendas!B18","v":"Rappels sobre ventas producto Cuero tienda Madrid 3"}]
[{"$f":"$A$1996&Tiendas!A19","v":"7090012354"},{"$f":"$B$1996&\" \"&\"tienda\"&\" \"&Tiendas!B19","v":"Rappels sobre ventas producto Cuero tienda Madrid 4"}]
[{"$f":"$A$1996&Tiendas!A20","v":"7090012355"},{"$f":"$B$1996&\" \"&\"tienda\"&\" \"&Tiendas!B20","v":"Rappels sobre ventas producto Cuero tienda Madrid 5"}]
[{"$f":"$A$1996&Tiendas!A21","v":"7090012361"},{"$f":"$B$1996&\" \"&\"tienda\"&\" \"&Tiendas!B21","v":"Rappels sobre ventas producto Cuero tienda Barcelona 1"}]
[{"$f":"$A$1996&Tiendas!A22","v":"7090012362"},{"$f":"$B$1996&\" \"&\"tienda\"&\" \"&Tiendas!B22","v":"Rappels sobre ventas producto Cuero tienda Barcelona 2"}]
[{"$f":"$A$1996&Tiendas!A23","v":"7090012363"},{"$f":"$B$1996&\" \"&\"tienda\"&\" \"&Tiendas!B23","v":"Rappels sobre ventas producto Cuero tienda Barcelona 3"}]
[{"$f":"$A$1996&Tiendas!A24","v":"7090012364"},{"$f":"$B$1996&\" \"&\"tienda\"&\" \"&Tiendas!B24","v":"Rappels sobre ventas producto Cuero tienda Barcelona 4"}]
[{"$f":"$A$1996&Tiendas!A25","v":"7090012371"},{"$f":"$B$1996&\" \"&\"tienda\"&\" \"&Tiendas!B25","v":"Rappels sobre ventas producto Cuero tienda Bilbao 1"}]
[{"$f":"$A$1996&Tiendas!A26","v":"7090012372"},{"$f":"$B$1996&\" \"&\"tienda\"&\" \"&Tiendas!B26","v":"Rappels sobre ventas producto Cuero tienda Bilbao 2"}]
[{"$f":"$A$1996&Tiendas!A27","v":"7090012380"},{"$f":"$B$1996&\" \"&\"tienda\"&\" \"&Tiendas!B27","v":"Rappels sobre ventas producto Cuero tienda Almacén"}]
[7091,"RAPPELS SOBRE VENTAS DE PRODUCTOS TERMINADOS"]
[7092,"RAPPELS SOBRE VENTAS DE PRODUCTOS SEMITERMINADOS"]
[7093,"RAPPELS SOBRE VENTAS DE SUBPRODUCTOS Y RESIDUOS"]
[7094,"RAPPELS SOBRE VENTAS DE ENVASES Y EMBALAJES"]
["71.","VARIACIÓN DE EXISTENCIAS"]
[710,"VARIACIÓN DE EXISTENCIAS DE PRODUCTOS EN CURSO"]
[711,"VARIACIÓN DE EXISTENCIAS DE PRODUCTOS SEMITERMINADOS"]
[712,"VARIACIÓN DE EXISTENCIAS DE PRODUCTOS TERMINADOS"]
[713,"VARIACIÓN DE EXISTENCIAS DE SUBPRODUCTOS, RESIDUOS Y MATERIALES RECUPERADOS"]
["73.","TRABAJOS REALIZADOS PARA LA EMPRESA"]
[730,"TRABAJOS REALIZADOS PARA EL INMOVILIZADO INTANGIBLE"]
[731,"TRABAJOS REALIZADOS PARA EL INMOVILIZADO MATERIAL"]
[732,"TRABAJOS REALIZADOS EN INVERSIONES INMOBILIARIAS"]
[733,"TRABAJOS REALIZADOS PARA EL INMOVILIZADO MATERIAL EN CURSO"]
["74.","SUBVENCIONES, DONACIONES Y LEGADOS"]
[7400000001,"SUBVENCIONES, DONACIONES Y LEGADOS A LA EXPLOTACIÓN"]
[7460000001,"SUBVENCIONES, DONACIONES Y LEGADOS DE CAPITAL TRANSFERIDOS AL RESULTADO DEL EJERCICIO"]
[7470000001,"OTRAS SUBVENCIONES, DONACIONES Y LEGADOS TRANSFERIDOS AL RESULTADO DEL EJERCICIO"]
["75.","OTROS INGRESOS DE GESTIÓN"]
[751,"RESULTADOS DE OPERACIONES EN COMÚN"]
[7510,"PÉRDIDA TRANSFERIDA (GESTOR)"]
[7511,"BENEFICIO ATRIBUIDO (PARTÍCIPE O ASOCIADO NO GESTOR)"]
[752,"INGRESOS POR ARRENDAMIENTOS"]
[753,"INGRESOS DE PROPIEDAD INDUSTRIAL CEDIDA EN EXPLOTACIÓN"]
[{"$f":"\"75300000\"&Franquicias!A2","v":"7530000091"},{"$f":"\"Ingresos de propiedad industrial cedida en explotación. Franquicia \"&Franquicias!B2","v":"Ingresos de propiedad industrial cedida en explotación. Franquicia Vimianzo SL"}]
[{"$f":"\"75300000\"&Franquicias!A3","v":"7530000092"},{"$f":"\"Ingresos de propiedad industrial cedida en explotación. Franquicia \"&Franquicias!B3","v":"Ingresos de propiedad industrial cedida en explotación. Franquicia Camariñas SL"}]
[{"$f":"\"75300000\"&Franquicias!A4","v":"7530000093"},{"$f":"\"Ingresos de propiedad industrial cedida en explotación. Franquicia \"&Franquicias!B4","v":"Ingresos de propiedad industrial cedida en explotación. Franquicia Muxía SL"}]
[{"$f":"\"75300000\"&Franquicias!A5","v":"7530000094"},{"$f":"\"Ingresos de propiedad industrial cedida en explotación. Franquicia \"&Franquicias!B5","v":"Ingresos de propiedad industrial cedida en explotación. Franquicia Costa da Morte SL"}]
[{"$f":"\"75300000\"&Franquicias!A6","v":"7530000095"},{"$f":"\"Ingresos de propiedad industrial cedida en explotación. Franquicia \"&Franquicias!B6","v":"Ingresos de propiedad industrial cedida en explotación. Franquicia Malpica SL"}]
[{"$f":"\"75300000\"&Franquicias!A7","v":"7530000096"},{"$f":"\"Ingresos de propiedad industrial cedida en explotación. Franquicia \"&Franquicias!B7","v":"Ingresos de propiedad industrial cedida en explotación. Franquicia Dumbría SL"}]
[754,"INGRESOS POR COMISIONES"]
[755,"INGRESOS POR SERVICIOS AL PERSONAL"]
[759,"INGRESOS POR SERVICIOS DIVERSOS"]
["76.","INGRESOS FINANCIEROS"]
[760,"INGRESOS DE PARTICIPACIONES EN INSTRUMENTOS DE PATRIMONIO"]
[7600,"INGRESOS DE PARTICIPACIONES EN INSTRUMENTOS DE PATRIMONIO, EMPRESAS DEL GRUPO"]
[7601,"INGRESOS DE PARTICIPACIONES EN INSTRUMENTOS DE PATRIMONIO, EMPRESAS ASOCIADAS"]
[7602,"INGRESOS DE PARTICIPACIONES EN INSTRUMENTOS DE PATRIMONIO, OTRAS PARTES VINCULADAS"]
[7603,"INGRESOS DE PARTICIPACIONES EN INSTRUMENTOS DE PATRIMONIO, OTRAS EMPRESAS"]
[761,"INGRESOS DE VALORES REPRESENTATIVOS DE DEUDA"]
[7610,"INGRESOS DE VALORES REPRESENTATIVOS DE DEUDA, EMPRESAS DEL GRUPO"]
[7611,"INGRESOS DE VALORES REPRESENTATIVOS DE DEUDA, EMPRESAS ASOCIADAS"]
[7612,"INGRESOS DE VALORES REPRESENTATIVOS DE DEUDA, OTRAS PARTES VINCULADAS"]
[7613,"INGRESOS DE VALORES REPRESENTATIVOS DE DEUDA, OTRAS EMPRESAS"]
[762,"INGRESOS DE CRÉDITOS"]
[7620,"INGRESOS DE CRÉDITOS A LARGO PLAZO"]
[76200,"INGRESOS DE CRÉDITOS A LARGO PLAZO, EMPRESAS DEL GRUPO"]
[76201,"INGRESOS DE CRÉDITOS A LARGO PLAZO, EMPRESAS ASOCIADAS"]
[76202,"INGRESOS DE CRÉDITOS A LARGO PLAZO, OTRAS PARTES VINCULADAS"]
[76203,"INGRESOS DE CRÉDITOS A LARGO PLAZO, OTRAS EMPRESAS"]
[7621,"INGRESOS DE CRÉDITOS A CORTO PLAZO"]
[76210,"INGRESOS DE CRÉDITOS A CORTO PLAZO, EMPRESAS DEL GRUPO"]
[76211,"INGRESOS DE CRÉDITOS A CORTO PLAZO, EMPRESAS ASOCIADAS"]
[76212,"INGRESOS DE CRÉDITOS A CORTO PLAZO, OTRAS PARTES VINCULADAS"]
[76213,"INGRESOS DE CRÉDITOS A CORTO PLAZO, OTRAS EMPRESAS"]
[763,"BENEFICIOS POR VALORACIÓN DE ACTIVOS Y PASIVOS FINANCIEROS POR SU VALOR RAZONABLE"]
[766,"BENEFICIOS EN PARTICIPACIONES Y VALORES REPRESENTATIVOS DE DEUDA"]
[7660,"BENEFICIOS EN VALORES REPRESENTATIVOS DE DEUDA A LARGO PLAZO, EMPRESAS DEL GRUPO"]
[7661,"BENEFICIOS EN VALORES REPRESENTATIVOS DE DEUDA A LARGO PLAZO, EMPRESAS ASOCIADAS"]
[7662,"BENEFICIOS EN VALORES REPRESENTATIVOS DE DEUDA A LARGO PLAZO, OTRAS PARTES VINCULADAS"]
[7663,"BENEFICIOS EN PATICIPACIONES Y VALORES REPRESENTATIVOS DE DEUDA A LARGO PLAZO, OTRAS EMPRESAS"]
[7665,"BENEFICIOS EN PARTICIPACIONES Y VALORES REPRESENTATIVOS DE DEUDA A CORTO PLAZO, EMPRESAS DEL GRUPO"]
[7666,"BENEFICIOS EN PARTICIPACIONES Y VALORES REPRESENTATIVOS DE DEUDA A CORTO PLAZO, EMPRESAS ASOCIADAS"]
[7667,"BENEFICIOS EN VALORES REPRESENTATIVOS DE DEUDA A CORTO PLAZO, OTRAS PARTES VINCULADAS"]
[7668,"BENEFICIOS EN VALORES REPRESENTATIVOS DE DEUDA A CORTO PLAZO, OTRAS EMPRESAS"]
[768,"DIFERENCIAS POSITIVAS DE CAMBIO"]
[7690000001,"OTROS INGRESOS FINANCIEROS"]
["77.","BENEFICIOS PROCEDENTES DE ACTIVOS NO CORRIENTES E INGRESOS EXCEPCIONALES"]
[770,"BENEFICIOS PROCEDENTES DEL INMOVILIZADO INTANGIBLE"]
[771,"BENEFICIOS PROCEDENTES DEL INMOVILIZADO MATERIAL"]
[772,"BENEFICIOS PROCEDENTES DE LAS INVERSIONES INMOBILIARIAS"]
[773,"BENEFICIOS PROCEDENTES DE PARTICIPACIONES A LARGO PLAZO EN PARTES VINCULADAS"]
[7733,"BENEFICIOS PROCEDENTES DE PARTICIPACIONES A LARGO PLAZO, EMPRESAS DEL GRUPO"]
[7734,"BENEFICIOS PROCEDENTES DE PARTICIPACIONES A LARGO PLAZO, EMPRESAS ASOCIADAS"]
[7735,"BENEFICIOS PROCEDENTES DE PARTICIPACIONES A LARGO PLAZO, OTRAS PARTES VINCULADAS"]
[775,"BENEFICIOS POR OPERACIONES CON OBLIGACIONES PROPIAS"]
[7780000001,"INGRESOS EXCEPCIONALES"]
["79.","EXCESOS Y APLICACIONES DE PROVISIONES Y DE PÉRDIDAS POR DETERIORO"]
[790,"REVERSIÓN DEL DETERIORO DEL INMOVILIZADO INTANGIBLE"]
[791,"REVERSIÓN DEL DETERIORO DEL INMOVILIZADO MATERIAL"]
[792,"REVERSIÓN DEL DETERIORO DE LAS INVERSIONES INMOBILIARIAS"]
[793,"REVERSIÓN DEL DETERIORO DE EXISTENCIAS"]
[7930,"REVERSIÓN DEL DETERIORO DE PRODUCTOS TERMINADOS Y EN CURSO DE FABRICACIÓN"]
[7931,"REVERSIÓN DEL DETERIORO DE MERCADERÍAS"]
[7932,"REVERSIÓN DEL DETERIORO DE MATERIAS PRIMAS"]
[7933,"REVERSIÓN DEL DETERIORO DE OTROS APROVISIONAMIENTOS"]
[794,"REVERSIÓN DEL DETERIORO DE CRÉDITOS POR OPERACIONES COMERCIALES"]
[795,"EXCESO DE PROVISIONES"]
[7951,"EXCESO DE PROVISIÓN PARA IMPUESTOS"]
[7952,"EXCESO DE PROVISIÓN PARA OTRAS RESPONSABILIDADES"]
[7954,"EXCESO DE PROVISIÓN POR OPERACIONES COMERCIALES"]
[79544,"EXCESO DE PROVISIÓN POR CONTRATOS ONEROSOS"]
[79549,"EXCESO DE PROVISIÓN PARA OTRAS OPERACIONES COMERCIALES"]
[7955000001,"EXCESO DE PROVISIÓN PARA ACTUACIONES MEDIOAMBIENTALES"]
[796,"REVERSIÓN DEL DETERIORO DE PARTICIPACIONES Y VALORES REPRESENTATIVOS DE DEUDA A LARGO PLAZO"]
[7960,"REVERSIÓN DEL DETERIORO DE PARTICIPACIONES EN INSTRUMENTOS DE PATRIMONIO NETO A LARGO PLAZO, EMPRESAS DEL GRUPO"]
[7961,"REVERSIÓN DEL DETERIORO DE PARTICIPACIONES EN INSTRUMENTOS DE PATRIMONIO NETO A LARGO PLAZO, EMPRESAS ASOCIADAS"]
[7962,"REVERSIÓN DEL DETERIORO DE PARTICIPACIONES EN INSTRUMENTOS DE PATRIMONIO NETO A LARGO PLAZO, OTRAS PARTES VINCULADAS"]
[7963,"REVERSIÓN DEL DETERIORO DE PARTICIPACIONES EN INSTRUMENTOS DE PATRIMONIO NETO A LARGO PLAZO, OTRAS EMPRESAS"]
[7965,"REVERSIÓN DEL DETERIORO DE VALORES REPRESENTATIVOS DE DEUDA A LARGO PLAZO, EMPRESAS DEL GRUPO"]
[7966,"REVERSIÓN DEL DETERIORO DE VALORES REPRESENTATIVOS DE DEUDA A LARGO PLAZO, EMPRESAS ASOCIADAS"]
[7967,"REVERSIÓN DEL DETERIORO DE VALORES REPRESENTATIVOS DE DEUDA A LARGO PLAZO, OTRAS PARTES VINCULADAS"]
[7968,"REVERSIÓN DEL DETERIORO DE VALORES REPRESENTATIVOS DE DEUDA A LARGO PLAZO, OTRAS EMPRESAS"]
[797,"REVERSIÓN DEL DETERIORO DE CRÉDITOS A LARGO PLAZO"]
[7970,"REVERSIÓN DEL DETERIORO DE CRÉDITOS A LARGO PLAZO, EMPRESAS DEL GRUPO"]
[7971,"REVERSIÓN DEL DETERIORO DE CRÉDITOS A LARGO PLAZO, EMPRESAS ASOCIADAS"]
[7972,"REVERSIÓN DEL DETERIORO DE CRÉDITOS A LARGO PLAZO, OTRAS PARTES VINCULADAS"]
[7973,"REVERSIÓN DEL DETERIORO DE CRÉDITOS A LARGO PLAZO, OTRAS EMPRESAS"]
[798,"REVERSIÓN DEL DETERIORO DE PARTICIPACIONES Y VALORES REPRESENTATIVOS DE DEUDA A CORTO PLAZO"]
[7980,"REVERSIÓN DEL DETERIORO DE PARTICIPACIONES EN INSTRUMENTOS DE PATRIMONIO NETO A CORTO PLAZO, EMPRESAS DEL GRUPO"]
[7981,"REVERSIÓN DEL DETERIORO DE PARTICIPACIONES EN INSTRUMENTOS DE PATRIMONIO NETO A CORTO PLAZO, EMPRESAS ASOCIADAS"]
[7985,"REVERSIÓN DEL DETERIORO EN VALORES REPRESENTATIVOS DE DEUDA A CORTO PLAZO, EMPRESAS DEL GRUPO"]
[7986,"REVERSIÓN DEL DETERIORO EN VALORES REPRESENTATIVOS DE DEUDA A CORTO PLAZO, EMPRESAS ASOCIADAS"]
[7987,"REVERSIÓN DEL DETERIORO EN VALORES REPRESENTATIVOS DE DEUDA A CORTO PLAZO, OTRAS PARTES VINCULADAS"]
[7988,"REVERSIÓN DEL DETERIORO EN VALORES REPRESENTATIVOS DE DEUDA A CORTO PLAZO, OTRAS EMPRESAS"]
[799,"REVERSIÓN DEL DETERIORO DE CRÉDITOS A CORTO PLAZO"]
[7990,"REVERSIÓN DEL DETERIORO DE CRÉDITOS A CORTO PLAZO, EMPRESAS DEL GRUPO"]
[7991,"REVERSIÓN DEL DETERIORO DE CRÉDITOS A CORTO PLAZO, EMPRESAS ASOCIADAS"]
[7992,"REVERSIÓN DEL DETERIORO DE CRÉDITOS A CORTO PLAZO, OTRAS PARTES VINCULADAS"]
[7993,"REVERSIÓN DEL DETERIORO DE CRÉDITOS A CORTO PLAZO, OTRAS EMPRESAS"]

{"sheet":"Tiendas","index":1,"n_rows":31,"n_cols":12,"rows_kept":31}
["Id Tienda","Nombre","IdZona","m2","Horas","IdFranquiciado","Cta. Caja","Banco Efectivo","Id Banco Efec.","Cta. Banco Efectivo","Cta. Banco Tj","DíasDesplazamiento"]
[11,"A Coruña 1",1,80,null,null,{"$f":"\"57000000\"&A2","v":"5700000011"},{"$f":"VLOOKUP(I2,Tarjetas!$F$2:$G$7,2)","v":"Abanca"},3,{"$f":"\"572001000\"&I2","v":"5720010003"},{"$f":"\"572002000\"&1","v":"5720020001"},3]
[12,"A Coruña 2",1,83,null,91,{"$f":"\"57000000\"&A3","v":"5700000012"},{"$f":"VLOOKUP(I3,Tarjetas!$F$2:$G$7,2)","v":"Abanca"},3,{"$f":"\"572001000\"&I3","v":"5720010003"},{"$f":"\"572002000\"&1","v":"5720020001"},4]
[13,"A Coruña 3",1,95,null,94,"5700000013",{"$f":"VLOOKUP(I4,Tarjetas!$F$2:$G$7,2)","v":"Abanca"},3,"5720010003","5720020001",3]
[14,"A Coruña 4",1,75,null,91,"5700000014",{"$f":"VLOOKUP(I5,Tarjetas!$F$2:$G$7,2)","v":"Abanca"},3,"5720010003","5720020001",3]
[15,"A Coruña 5",1,70,null,null,"5700000015",{"$f":"VLOOKUP(I6,Tarjetas!$F$2:$G$7,2)","v":"BBVA"},2,"5720010002","5720020001",3]
[21,"Lugo 1",1,70,null,92,"5700000021",{"$f":"VLOOKUP(I7,Tarjetas!$F$2:$G$7,2)","v":"Abanca"},3,"5720010003","5720020001",3]
[22,"Lugo 2",1,74,null,92,"5700000022",{"$f":"VLOOKUP(I8,Tarjetas!$F$2:$G$7,2)","v":"Abanca"},3,"5720010003","5720020001",3]
[31,"Ourense 1",1,88,null,95,"5700000031",{"$f":"VLOOKUP(I9,Tarjetas!$F$2:$G$7,2)","v":"Abanca"},3,"5720010003","5720020001",4]
[32,"Ourense 2",1,85,null,null,"5700000032",{"$f":"VLOOKUP(I10,Tarjetas!$F$2:$G$7,2)","v":"Santander"},1,"5720010001","5720020001",3]
[33,"Ourense 3",1,82,null,null,"5700000033",{"$f":"VLOOKUP(I11,Tarjetas!$F$2:$G$7,2)","v":"Santander"},1,"5720010001","5720020001",3]
[41,"Pontevedra 1",1,62,null,96,"5700000041",{"$f":"VLOOKUP(I12,Tarjetas!$F$2:$G$7,2)","v":"Abanca"},3,"5720010003","5720020001",3]
[42,"Pontevedra 2",1,78,null,null,"5700000042",{"$f":"VLOOKUP(I13,Tarjetas!$F$2:$G$7,2)","v":"Abanca"},3,"5720010003","5720020001",3]
[43,"Pontevedra 3",1,98,null,95,"5700000043",{"$f":"VLOOKUP(I14,Tarjetas!$F$2:$G$7,2)","v":"BBVA"},2,"5720010002","5720020001",3]
[44,"Pontevedra 4",1,75,null,null,"5700000044",{"$f":"VLOOKUP(I15,Tarjetas!$F$2:$G$7,2)","v":"Abanca"},3,"5720010003","5720020001",4]
[51,"Madrid 1",2,104,null,93,"5700000051",{"$f":"VLOOKUP(I16,Tarjetas!$F$2:$G$7,2)","v":"Santander"},1,"5720010001","5720020001",3]
[52,"Madrid 2",2,95,null,95,"5700000052",{"$f":"VLOOKUP(I17,Tarjetas!$F$2:$G$7,2)","v":"Santander"},1,"5720010001","5720020001",3]
[53,"Madrid 3",2,96,null,null,"5700000053",{"$f":"VLOOKUP(I18,Tarjetas!$F$2:$G$7,2)","v":"BBVA"},2,"5720010002","5720020001",3]
[54,"Madrid 4",2,99,null,null,"5700000054",{"$f":"VLOOKUP(I19,Tarjetas!$F$2:$G$7,2)","v":"Banco Pastor"},5,"5720010005","5720020001",3]
[55,"Madrid 5",2,88,null,92,"5700000055",{"$f":"VLOOKUP(I20,Tarjetas!$F$2:$G$7,2)","v":"Banco Pastor"},5,"5720010005","5720020001",3]
[61,"Barcelona 1",3,106,null,null,"5700000061",{"$f":"VLOOKUP(I21,Tarjetas!$F$2:$G$7,2)","v":"La Caixa"},6,"5720010006","5720020001",3]
[62,"Barcelona 2",3,98,null,null,"5700000062",{"$f":"VLOOKUP(I22,Tarjetas!$F$2:$G$7,2)","v":"La Caixa"},6,"5720010006","5720020001",3]
[63,"Barcelona 3",3,76,null,null,"5700000063",{"$f":"VLOOKUP(I23,Tarjetas!$F$2:$G$7,2)","v":"La Caixa"},6,"5720010006","5720020001",3]
[64,"Barcelona 4",3,89,null,93,"5700000064",{"$f":"VLOOKUP(I24,Tarjetas!$F$2:$G$7,2)","v":"Sabadell"},4,"5720010004","5720020001",3]
[71,"Bilbao 1",3,95,null,null,"5700000071",{"$f":"VLOOKUP(I25,Tarjetas!$F$2:$G$7,2)","v":"Sabadell"},4,"5720010004","5720020001",3]
[72,"Bilbao 2",3,97,null,null,"5700000072",{"$f":"VLOOKUP(I26,Tarjetas!$F$2:$G$7,2)","v":"Sabadell"},4,"5720010004","5720020001",3]
[80,"Almacén",{"$nulls":4},{"$f":"\"5700000\"&A27","v":"570000080"},{"$f":"VLOOKUP(I27,Tarjetas!$F$2:$G$7,2)","v":"BBVA"},2,"5720010002","5720020001"]
[]
[]
[null," "]
[null," "]

{"sheet":"Franquicias","index":2,"n_rows":13,"n_cols":8,"rows_kept":13}
["Id. Franq","Nombre","Tipo","%Royaltie","%Venta","Cta.Cliente","Cta.Deudor","Cta. Royaltie"]
[91,"Vimianzo SL","D",{"v":0.02,"d":"2.00%"},{"v":0.8,"d":"80.00%"},{"$f":"\"43000000\"&A2","v":"4300000091"},{"$f":"\"44000000\"&A2","v":"4400000091"},{"$f":"\"70500000\"&A2","v":"7050000091"}]
[92,"Camariñas SL","F",{"v":0.0175,"d":"1.75%"},{"v":0.67,"d":"67.00%"},"4300000092","4400000092",{"$f":"\"70500000\"&A3","v":"7050000092"}]
[93,"Muxía SL","F",{"v":0.015,"d":"1.50%"},{"v":0.67,"d":"67.00%"},"4300000093","4400000093","7050000093"]
[94,"Costa da Morte SL","D",{"v":0.02,"d":"2.00%"},{"v":0.8,"d":"80.00%"},"4300000094","4400000094","7050000094"]
[95,"Malpica SL","F",{"v":0.015,"d":"1.50%"},{"v":0.67,"d":"67.00%"},"4300000095","4400000095","7050000095"]
[96,"Dumbría SL","F",{"v":0.02,"d":"2.00%"},{"v":0.67,"d":"67.00%"},"4300000096","4400000096","7050000096"]
[]
[]
[]
[]
[null,"Royaltie (IVA) ","Cta. IVA Royaltie"]
[null,{"v":0.21,"d":"21%"},{"$f":"\"477000\"&TEXT(B13*10000,\"0000\")","v":"4770002100"}]

{"sheet":"Zonas","index":3,"n_rows":6,"n_cols":2,"rows_kept":6}
[]
[]
["Id zona","Nombre"]
[1,"Galicia"]
[2,"Madrid"]
[3,"Barcelona/Bilbao"]

{"sheet":"Días Semana","index":4,"n_rows":8,"n_cols":2,"rows_kept":8}
["Id día","Nombre"]
[1,"Lunes"]
[2,"Martes"]
[3,"Miércoles"]
[4,"Jueves"]
[5,"Viernes"]
[6,"Sábado"]
[7,"Domingo"]

{"sheet":"Familias","index":5,"n_rows":8,"n_cols":4,"rows_kept":8}
[]
["Id Familia","Descripción","% IVA","Cuenta IVA"]
[111,"Mar",{"v":0.1,"d":"10%"},{"$f":"\"477000\"&TEXT(C3*10000,\"0000\")","v":"4770001000"}]
[112,"Campo",{"v":0.04,"d":"4%"},{"$f":"\"477000\"&TEXT(C4*10000,\"0000\")","v":"4770000400"}]
[113,"Bebidas",{"v":0.21,"d":"21%"},"4770002100"]
[121,"Cerámicas",{"v":0.21,"d":"21%"},"4770002100"]
[122,"Encaje",{"v":0.21,"d":"21%"},"4770002100"]
[123,"Cuero",{"v":0.21,"d":"21%"},"4770002100"]

{"sheet":"Cuentas","index":6,"n_rows":8,"n_cols":6,"rows_kept":8}
[]
["Descripción","Cuenta","Desglose",null,"Desglose","Descripción"]
["Ventas en tiendas propias",700,11,null,11,"Tienda y familia"]
["Ventas en tiendas a franquicia en depósito",700,11,null,10,"Tienda"]
["Ventas en tiendas a franquicias en firme",700,11,null,12,"Por franquiciado"]
["Ingreso por Royaltie",705,12,null,20,"Familia"]
["Compras",600,20,null,21,"Tipo IVA"]
["Cuenta de IVA de ventas (repercutido)",477,21]

{"sheet":"Pagos tienda","index":7,"n_rows":20,"n_cols":8,"rows_kept":20}
["IdPago","Concepto","Cuenta Contable","Signo Apunte","Desglose","% IVA","Cta IVA Sop.","Observaciones"]
[1,"Anticipos a empleados",460,"D",22,{"v":0,"d":"0.00%"},{"$f":"IF(Tabla14[[#This Row],[% IVA]]<>0,\"472000\"&(TEXT(F2*10000,\"0000\")),\"\")","v":""},"En concepto llevará el número del empleado"]
[2,"Devolución de anticipos a empleados",460,"H",22,{"v":0,"d":"0.00%"},{"$f":"IF(Tabla14[[#This Row],[% IVA]]<>0,\"472000\"&(TEXT(F3*10000,\"0000\")),\"\")","v":""}]
[3,"Papelería",602,"D",10,{"v":0.21,"d":"21.00%"},{"$f":"IF(Tabla14[[#This Row],[% IVA]]<>0,\"472000\"&(TEXT(F4*10000,\"0000\")),\"\")","v":"4720002100"}]
[4,"Transportes locales",624,"D",10,{"v":0.21,"d":"21.00%"},{"$f":"IF(Tabla14[[#This Row],[% IVA]]<>0,\"472000\"&(TEXT(F5*10000,\"0000\")),\"\")","v":"4720002100"}]
[5,"Material de limpieza",629,"D",10,{"v":0.21,"d":"21.00%"},{"$f":"IF(Tabla14[[#This Row],[% IVA]]<>0,\"472000\"&(TEXT(F6*10000,\"0000\")),\"\")","v":"4720002100"}]
[6,"Mantenimiento inmovilizado",622,"D",10,{"v":0.21,"d":"21.00%"},{"$f":"IF(Tabla14[[#This Row],[% IVA]]<>0,\"472000\"&(TEXT(F7*10000,\"0000\")),\"\")","v":"4720002100"}]
[7,"Alquiler del local",621,"D",10,{"v":0.21,"d":"21.00%"},{"$f":"IF(Tabla14[[#This Row],[% IVA]]<>0,\"472000\"&(TEXT(F8*10000,\"0000\")),\"\")","v":"4720002100"}]
[8,"Reparaciones básicas",622,"D",10,{"v":0.21,"d":"21.00%"},{"$f":"IF(Tabla14[[#This Row],[% IVA]]<>0,\"472000\"&(TEXT(F9*10000,\"0000\")),\"\")","v":"4720002100"}]
[9,"Impuestos locales",631,"D",10,{"v":0.21,"d":"21.00%"},{"$f":"IF(Tabla14[[#This Row],[% IVA]]<>0,\"472000\"&(TEXT(F10*10000,\"0000\")),\"\")","v":"4720002100"}]
[10,"Comunidad de propietarios",629,"D",10,{"v":0.21,"d":"21.00%"},{"$f":"IF(Tabla14[[#This Row],[% IVA]]<>0,\"472000\"&(TEXT(F11*10000,\"0000\")),\"\")","v":"4720002100"}]
[11,"Diferencias de arqueo (faltante)",659,"D",10,{"v":0,"d":"0.00%"},{"$f":"IF(Tabla14[[#This Row],[% IVA]]<>0,\"472000\"&(TEXT(F12*10000,\"0000\")),\"\")","v":""}]
[12,"Diferencias de arqueo (sobrante)",756,"H",10,{"v":0,"d":"0.00%"},{"$f":"IF(Tabla14[[#This Row],[% IVA]]<>0,\"472000\"&(TEXT(F13*10000,\"0000\")),\"\")","v":""}]
[]
[]
[]
[]
["Id Pago","Tipo de pago"]
[1,"Efectivo"]
[2,"Tarjeta"]

{"sheet":"Tarjetas","index":8,"n_rows":7,"n_cols":7,"rows_kept":7}
["Id Tarjeta","Nombre","% Comisión","Cta. Comisión",null,"Id Banco","Nombre"]
[1,"Visa",{"v":0.01,"d":"1%"},{"$f":"\"669\"&\"000000\"&A2","v":"6690000001"},null,1,"Santander"]
[2,"Master Card",{"v":0.0125,"d":"1.25%"},{"$f":"\"669\"&\"000000\"&A3","v":"6690000002"},null,2,"BBVA"]
[3,"American Express",{"v":0.015,"d":"1.50%"},{"$f":"\"669\"&\"000000\"&A4","v":"6690000003"},null,3,"Abanca"]
[4,"4B",{"v":0.0085,"d":"0.85%"},{"$f":"\"669\"&\"000000\"&A5","v":"6690000004"},null,4,"Sabadell"]
[{"$nulls":5},5,"Banco Pastor"]
[{"$nulls":5},6,"La Caixa"]

{"sheet":"VentasALMFranquiciasFirme","index":9,"n_rows":13,"n_cols":20,"rows_kept":13}
["Fecha","IdTienda","IdFamilia","Venta (IVA inc.)","Núm Factura","Id franquiciado","%IVA","Venta sin IVA","Imp. IVA","Cta. Clientes","Cta. Ventas","Cta. IVA","Concepto Clientes","Concepto Ventas","Concepto IVA Repercutido","Tipo IVA","nº IVA","Moneda","Control importe","Control tienda"]
[{"v":42058,"d":"4205800.00%"},21,111,745.3,1,{"$f":"VLOOKUP(B2,Tiendas!$A$3:$F$27,6)","v":92},{"$f":"VLOOKUP(C2,Familias!$A$3:$C$8,3)","v":{"v":0.1,"d":"10.00%"}},{"$f":"ROUND(Tabla1[[#This Row],[Venta (IVA inc.)]]/(1+G2),2)","v":677.55},{"$f":"ROUND(Tabla1[[#This Row],[Venta (IVA inc.)]]-H2,2)","v":67.75},{"$f":"VLOOKUP(F2,Franquicias!$A$2:$F$7,6)","v":"4300000092"},{"$f":"\"70000\"&C2&B2","v":"7000011121"},{"$f":"VLOOKUP(C2,Familias!$A$3:$D$8,4)","v":"4770001000"},{"$f":"\"Clientes. ALM Franq. \"&F2&\" Tienda \"&Tabla1[[#This Row],[IdTienda]]","v":"Clientes. ALM Franq. 92 Tienda 21"},{"$f":"\"Vtas. ALM Franq.\"&\" \"&F2&\" \"&\"Tienda \"&Tabla1[[#This Row],[IdTienda]]&\" Producto \"&Tabla1[[#This Row],[IdFamilia]]","v":"Vtas. ALM Franq. 92 Tienda 21 Producto 111"},{"$f":"\"IVA Rep. ALM Franq. \"&F2&\" \"&\"Tienda \"&Tabla1[[#This Row],[IdTienda]]","v":"IVA Rep. ALM Franq. 92 Tienda 21"},"R",1,"E",{"$f":"IF(Tabla1[[#This Row],[Venta (IVA inc.)]]>3000,\"REVISAR\",\"\")","v":""},{"$f":"IF(OR(F2=92,F2=93,F2=95,F2=96),\"\",\"REVISAR\")","v":""}]
[{"v":42058,"d":"4205800.00%"},22,122,221.3,{"$f":"E2+1","v":2},{"$f":"VLOOKUP(B3,Tiendas!$A$3:$F$27,6)","v":92},{"$f":"VLOOKUP(C3,Familias!$A$3:$C$8,3)","v":{"v":0.21,"d":"21.00%"}},{"$f":"ROUND(Tabla1[[#This Row],[Venta (IVA inc.)]]/(1+G3),2)","v":182.89},{"$f":"ROUND(Tabla1[[#This Row],[Venta (IVA inc.)]]-H3,2)","v":38.41},{"$f":"VLOOKUP(F3,Franquicias!$A$2:$F$7,6)","v":"4300000092"},{"$f":"\"70000\"&C3&B3","v":"7000012222"},{"$f":"VLOOKUP(C3,Familias!$A$3:$D$8,4)","v":"4770002100"},{"$f":"\"Clientes. ALM Franq. \"&F3&\" Tienda \"&Tabla1[[#This Row],[IdTienda]]","v":"Clientes. ALM Franq. 92 Tienda 22"},{"$f":"\"Vtas. ALM Franq.\"&\" \"&F3&\" \"&\"Tienda \"&Tabla1[[#This Row],[IdTienda]]&\" Producto \"&Tabla1[[#This Row],[IdFamilia]]","v":"Vtas. ALM Franq. 92 Tienda 22 Producto 122"},{"$f":"\"IVA Rep. ALM Franq. \"&F3&\" \"&\"Tienda \"&Tabla1[[#This Row],[IdTienda]]","v":"IVA Rep. ALM Franq. 92 Tienda 22"},"R",{"$f":"Q2+1","v":2},"E",{"$f":"IF(Tabla1[[#This Row],[Venta (IVA inc.)]]>3000,\"REVISAR\",\"\")","v":""},{"$f":"IF(OR(F3=92,F3=93,F3=95,F3=96),\"\",\"REVISAR\")","v":""}]
[{"v":42058,"d":"4205800.00%"},31,111,247.98,{"$f":"E3+1","v":3},{"$f":"VLOOKUP(B4,Tiendas!$A$3:$F$27,6)","v":95},{"$f":"VLOOKUP(C4,Familias!$A$3:$C$8,3)","v":{"v":0.1,"d":"10.00%"}},{"$f":"ROUND(Tabla1[[#This Row],[Venta (IVA inc.)]]/(1+G4),2)","v":225.44},{"$f":"ROUND(Tabla1[[#This Row],[Venta (IVA inc.)]]-H4,2)","v":22.54},{"$f":"VLOOKUP(F4,Franquicias!$A$2:$F$7,6)","v":"4300000095"},"7000011131",{"$f":"VLOOKUP(C4,Familias!$A$3:$D$8,4)","v":"4770001000"},{"$f":"\"Clientes. ALM Franq. \"&F4&\" Tienda \"&Tabla1[[#This Row],[IdTienda]]","v":"Clientes. ALM Franq. 95 Tienda 31"},{"$f":"\"Vtas. ALM Franq.\"&\" \"&F4&\" \"&\"Tienda \"&Tabla1[[#This Row],[IdTienda]]&\" Producto \"&Tabla1[[#This Row],[IdFamilia]]","v":"Vtas. ALM Franq. 95 Tienda 31 Producto 111"},{"$f":"\"IVA Rep. ALM Franq. \"&F4&\" \"&\"Tienda \"&Tabla1[[#This Row],[IdTienda]]","v":"IVA Rep. ALM Franq. 95 Tienda 31"},"R",{"$f":"Q3+1","v":3},"E",{"$f":"IF(Tabla1[[#This Row],[Venta (IVA inc.)]]>3000,\"REVISAR\",\"\")","v":""},""]
[{"v":42058,"d":"4205800.00%"},41,111,223.32,4,{"$f":"VLOOKUP(B5,Tiendas!$A$3:$F$27,6)","v":96},{"$f":"VLOOKUP(C5,Familias!$A$3:$C$8,3)","v":{"v":0.1,"d":"10.00%"}},{"$f":"ROUND(Tabla1[[#This Row],[Venta (IVA inc.)]]/(1+G5),2)","v":203.02},{"$f":"ROUND(Tabla1[[#This Row],[Venta (IVA inc.)]]-H5,2)","v":20.3},{"$f":"VLOOKUP(F5,Franquicias!$A$2:$F$7,6)","v":"4300000096"},"7000011141",{"$f":"VLOOKUP(C5,Familias!$A$3:$D$8,4)","v":"4770001000"},{"$f":"\"Clientes. ALM Franq. \"&F5&\" Tienda \"&Tabla1[[#This Row],[IdTienda]]","v":"Clientes. ALM Franq. 96 Tienda 41"},{"$f":"\"Vtas. ALM Franq.\"&\" \"&F5&\" \"&\"Tienda \"&Tabla1[[#This Row],[IdTienda]]&\" Producto \"&Tabla1[[#This Row],[IdFamilia]]","v":"Vtas. ALM Franq. 96 Tienda 41 Producto 111"},{"$f":"\"IVA Rep. ALM Franq. \"&F5&\" \"&\"Tienda \"&Tabla1[[#This Row],[IdTienda]]","v":"IVA Rep. ALM Franq. 96 Tienda 41"},"R",4,"E",{"$f":"IF(Tabla1[[#This Row],[Venta (IVA inc.)]]>3000,\"REVISAR\",\"\")","v":""},""]
[{"v":42058,"d":"4205800.00%"},43,123,458.88,5,{"$f":"VLOOKUP(B6,Tiendas!$A$3:$F$27,6)","v":95},{"$f":"VLOOKUP(C6,Familias!$A$3:$C$8,3)","v":{"v":0.21,"d":"21.00%"}},{"$f":"ROUND(Tabla1[[#This Row],[Venta (IVA inc.)]]/(1+G6),2)","v":379.24},{"$f":"ROUND(Tabla1[[#This Row],[Venta (IVA inc.)]]-H6,2)","v":79.64},{"$f":"VLOOKUP(F6,Franquicias!$A$2:$F$7,6)","v":"4300000095"},"7000012343",{"$f":"VLOOKUP(C6,Familias!$A$3:$D$8,4)","v":"4770002100"},{"$f":"\"Clientes. ALM Franq. \"&F6&\" Tienda \"&Tabla1[[#This Row],[IdTienda]]","v":"Clientes. ALM Franq. 95 Tienda 43"},{"$f":"\"Vtas. ALM Franq.\"&\" \"&F6&\" \"&\"Tienda \"&Tabla1[[#This Row],[IdTienda]]&\" Producto \"&Tabla1[[#This Row],[IdFamilia]]","v":"Vtas. ALM Franq. 95 Tienda 43 Producto 123"},{"$f":"\"IVA Rep. ALM Franq. \"&F6&\" \"&\"Tienda \"&Tabla1[[#This Row],[IdTienda]]","v":"IVA Rep. ALM Franq. 95 Tienda 43"},"R",5,"E",{"$f":"IF(Tabla1[[#This Row],[Venta (IVA inc.)]]>3000,\"REVISAR\",\"\")","v":""},""]
[{"v":42058,"d":"4205800.00%"},51,113,888.01,6,{"$f":"VLOOKUP(B7,Tiendas!$A$3:$F$27,6)","v":93},{"$f":"VLOOKUP(C7,Familias!$A$3:$C$8,3)","v":{"v":0.21,"d":"21.00%"}},{"$f":"ROUND(Tabla1[[#This Row],[Venta (IVA inc.)]]/(1+G7),2)","v":733.89},{"$f":"ROUND(Tabla1[[#This Row],[Venta (IVA inc.)]]-H7,2)","v":154.12},{"$f":"VLOOKUP(F7,Franquicias!$A$2:$F$7,6)","v":"4300000093"},"7000011351",{"$f":"VLOOKUP(C7,Familias!$A$3:$D$8,4)","v":"4770002100"},{"$f":"\"Clientes. ALM Franq. \"&F7&\" Tienda \"&Tabla1[[#This Row],[IdTienda]]","v":"Clientes. ALM Franq. 93 Tienda 51"},{"$f":"\"Vtas. ALM Franq.\"&\" \"&F7&\" \"&\"Tienda \"&Tabla1[[#This Row],[IdTienda]]&\" Producto \"&Tabla1[[#This Row],[IdFamilia]]","v":"Vtas. ALM Franq. 93 Tienda 51 Producto 113"},{"$f":"\"IVA Rep. ALM Franq. \"&F7&\" \"&\"Tienda \"&Tabla1[[#This Row],[IdTienda]]","v":"IVA Rep. ALM Franq. 93 Tienda 51"},"R",6,"E",{"$f":"IF(Tabla1[[#This Row],[Venta (IVA inc.)]]>3000,\"REVISAR\",\"\")","v":""},""]
[{"v":42058,"d":"4205800.00%"},52,123,236.12,7,{"$f":"VLOOKUP(B8,Tiendas!$A$3:$F$27,6)","v":95},{"$f":"VLOOKUP(C8,Familias!$A$3:$C$8,3)","v":{"v":0.21,"d":"21.00%"}},{"$f":"ROUND(Tabla1[[#This Row],[Venta (IVA inc.)]]/(1+G8),2)","v":195.14},{"$f":"ROUND(Tabla1[[#This Row],[Venta (IVA inc.)]]-H8,2)","v":40.98},{"$f":"VLOOKUP(F8,Franquicias!$A$2:$F$7,6)","v":"4300000095"},"7000012352",{"$f":"VLOOKUP(C8,Familias!$A$3:$D$8,4)","v":"4770002100"},{"$f":"\"Clientes. ALM Franq. \"&F8&\" Tienda \"&Tabla1[[#This Row],[IdTienda]]","v":"Clientes. ALM Franq. 95 Tienda 52"},{"$f":"\"Vtas. ALM Franq.\"&\" \"&F8&\" \"&\"Tienda \"&Tabla1[[#This Row],[IdTienda]]&\" Producto \"&Tabla1[[#This Row],[IdFamilia]]","v":"Vtas. ALM Franq. 95 Tienda 52 Producto 123"},{"$f":"\"IVA Rep. ALM Franq. \"&F8&\" \"&\"Tienda \"&Tabla1[[#This Row],[IdTienda]]","v":"IVA Rep. ALM Franq. 95 Tienda 52"},"R",7,"E",{"$f":"IF(Tabla1[[#This Row],[Venta (IVA inc.)]]>3000,\"REVISAR\",\"\")","v":""},""]
[{"v":42058,"d":"4205800.00%"},55,122,455.11,8,{"$f":"VLOOKUP(B9,Tiendas!$A$3:$F$27,6)","v":92},{"$f":"VLOOKUP(C9,Familias!$A$3:$C$8,3)","v":{"v":0.21,"d":"21.00%"}},{"$f":"ROUND(Tabla1[[#This Row],[Venta (IVA inc.)]]/(1+G9),2)","v":376.12},{"$f":"ROUND(Tabla1[[#This Row],[Venta (IVA inc.)]]-H9,2)","v":78.99},{"$f":"VLOOKUP(F9,Franquicias!$A$2:$F$7,6)","v":"4300000092"},"7000012255",{"$f":"VLOOKUP(C9,Familias!$A$3:$D$8,4)","v":"4770002100"},{"$f":"\"Clientes. ALM Franq. \"&F9&\" Tienda \"&Tabla1[[#This Row],[IdTienda]]","v":"Clientes. ALM Franq. 92 Tienda 55"},{"$f":"\"Vtas. ALM Franq.\"&\" \"&F9&\" \"&\"Tienda \"&Tabla1[[#This Row],[IdTienda]]&\" Producto \"&Tabla1[[#This Row],[IdFamilia]]","v":"Vtas. ALM Franq. 92 Tienda 55 Producto 122"},{"$f":"\"IVA Rep. ALM Franq. \"&F9&\" \"&\"Tienda \"&Tabla1[[#This Row],[IdTienda]]","v":"IVA Rep. ALM Franq. 92 Tienda 55"},"R",8,"E",{"$f":"IF(Tabla1[[#This Row],[Venta (IVA inc.)]]>3000,\"REVISAR\",\"\")","v":""},""]
[{"v":42058,"d":"4205800.00%"},64,122,98,9,{"$f":"VLOOKUP(B10,Tiendas!$A$3:$F$27,6)","v":93},{"$f":"VLOOKUP(C10,Familias!$A$3:$C$8,3)","v":{"v":0.21,"d":"21.00%"}},{"$f":"ROUND(Tabla1[[#This Row],[Venta (IVA inc.)]]/(1+G10),2)","v":80.99},{"$f":"ROUND(Tabla1[[#This Row],[Venta (IVA inc.)]]-H10,2)","v":17.01},{"$f":"VLOOKUP(F10,Franquicias!$A$2:$F$7,6)","v":"4300000093"},"7000012264",{"$f":"VLOOKUP(C10,Familias!$A$3:$D$8,4)","v":"4770002100"},{"$f":"\"Clientes. ALM Franq. \"&F10&\" Tienda \"&Tabla1[[#This Row],[IdTienda]]","v":"Clientes. ALM Franq. 93 Tienda 64"},{"$f":"\"Vtas. ALM Franq.\"&\" \"&F10&\" \"&\"Tienda \"&Tabla1[[#This Row],[IdTienda]]&\" Producto \"&Tabla1[[#This Row],[IdFamilia]]","v":"Vtas. ALM Franq. 93 Tienda 64 Producto 122"},{"$f":"\"IVA Rep. ALM Franq. \"&F10&\" \"&\"Tienda \"&Tabla1[[#This Row],[IdTienda]]","v":"IVA Rep. ALM Franq. 93 Tienda 64"},"R",9,"E",{"$f":"IF(Tabla1[[#This Row],[Venta (IVA inc.)]]>3000,\"REVISAR\",\"\")","v":""},""]
[{"v":42058,"d":"4205800.00%"},41,111,311.11,10,{"$f":"VLOOKUP(B11,Tiendas!$A$3:$F$27,6)","v":96},{"$f":"VLOOKUP(C11,Familias!$A$3:$C$8,3)","v":{"v":0.1,"d":"10.00%"}},{"$f":"ROUND(Tabla1[[#This Row],[Venta (IVA inc.)]]/(1+G11),2)","v":282.83},{"$f":"ROUND(Tabla1[[#This Row],[Venta (IVA inc.)]]-H11,2)","v":28.28},{"$f":"VLOOKUP(F11,Franquicias!$A$2:$F$7,6)","v":"4300000096"},"7000011141",{"$f":"VLOOKUP(C11,Familias!$A$3:$D$8,4)","v":"4770001000"},{"$f":"\"Clientes. ALM Franq. \"&F11&\" Tienda \"&Tabla1[[#This Row],[IdTienda]]","v":"Clientes. ALM Franq. 96 Tienda 41"},{"$f":"\"Vtas. ALM Franq.\"&\" \"&F11&\" \"&\"Tienda \"&Tabla1[[#This Row],[IdTienda]]&\" Producto \"&Tabla1[[#This Row],[IdFamilia]]","v":"Vtas. ALM Franq. 96 Tienda 41 Producto 111"},{"$f":"\"IVA Rep. ALM Franq. \"&F11&\" \"&\"Tienda \"&Tabla1[[#This Row],[IdTienda]]","v":"IVA Rep. ALM Franq. 96 Tienda 41"},"R",10,"E",{"$f":"IF(Tabla1[[#This Row],[Venta (IVA inc.)]]>3000,\"REVISAR\",\"\")","v":""},""]
[{"v":42058,"d":"4205800.00%"},31,122,111.22,11,{"$f":"VLOOKUP(B12,Tiendas!$A$3:$F$27,6)","v":95},{"$f":"VLOOKUP(C12,Familias!$A$3:$C$8,3)","v":{"v":0.21,"d":"21.00%"}},{"$f":"ROUND(Tabla1[[#This Row],[Venta (IVA inc.)]]/(1+G12),2)","v":91.92},{"$f":"ROUND(Tabla1[[#This Row],[Venta (IVA inc.)]]-H12,2)","v":19.3},{"$f":"VLOOKUP(F12,Franquicias!$A$2:$F$7,6)","v":"4300000095"},"7000012231",{"$f":"VLOOKUP(C12,Familias!$A$3:$D$8,4)","v":"4770002100"},{"$f":"\"Clientes. ALM Franq. \"&F12&\" Tienda \"&Tabla1[[#This Row],[IdTienda]]","v":"Clientes. ALM Franq. 95 Tienda 31"},{"$f":"\"Vtas. ALM Franq.\"&\" \"&F12&\" \"&\"Tienda \"&Tabla1[[#This Row],[IdTienda]]&\" Producto \"&Tabla1[[#This Row],[IdFamilia]]","v":"Vtas. ALM Franq. 95 Tienda 31 Producto 122"},{"$f":"\"IVA Rep. ALM Franq. \"&F12&\" \"&\"Tienda \"&Tabla1[[#This Row],[IdTienda]]","v":"IVA Rep. ALM Franq. 95 Tienda 31"},"R",11,"E",{"$f":"IF(Tabla1[[#This Row],[Venta (IVA inc.)]]>3000,\"REVISAR\",\"\")","v":""},""]
[{"v":42058,"d":"4205800.00%"},64,113,265,12,{"$f":"VLOOKUP(B13,Tiendas!$A$3:$F$27,6)","v":93},{"$f":"VLOOKUP(C13,Familias!$A$3:$C$8,3)","v":{"v":0.21,"d":"21.00%"}},{"$f":"ROUND(Tabla1[[#This Row],[Venta (IVA inc.)]]/(1+G13),2)","v":219.01},{"$f":"ROUND(Tabla1[[#This Row],[Venta (IVA inc.)]]-H13,2)","v":45.99},{"$f":"VLOOKUP(F13,Franquicias!$A$2:$F$7,6)","v":"4300000093"},"7000011364",{"$f":"VLOOKUP(C13,Familias!$A$3:$D$8,4)","v":"4770002100"},{"$f":"\"Clientes. ALM Franq. \"&F13&\" Tienda \"&Tabla1[[#This Row],[IdTienda]]","v":"Clientes. ALM Franq. 93 Tienda 64"},{"$f":"\"Vtas. ALM Franq.\"&\" \"&F13&\" \"&\"Tienda \"&Tabla1[[#This Row],[IdTienda]]&\" Producto \"&Tabla1[[#This Row],[IdFamilia]]","v":"Vtas. ALM Franq. 93 Tienda 64 Producto 113"},{"$f":"\"IVA Rep. ALM Franq. \"&F13&\" \"&\"Tienda \"&Tabla1[[#This Row],[IdTienda]]","v":"IVA Rep. ALM Franq. 93 Tienda 64"},"R",12,"E",{"$f":"IF(Tabla1[[#This Row],[Venta (IVA inc.)]]>3000,\"REVISAR\",\"\")","v":""},""]

{"sheet":"ConfigVentasALMFraqFirme","index":10,"n_rows":23,"n_cols":17,"rows_kept":23,"merged":[[0,3,0,5],[1,3,1,5]]}
["Hoja con los datos de entrada:",null,null,"VentasALMFranquiciasFirme"]
["Datos de salida:",null,null,"Asto.VentasALMFranquiciasFirme"]
["Primer número de asiento:",null,null,1]
["Procedimientos a ejecutar previamente:",{"$nulls":3},"Macro1","Macro2"]
[]
[]
[]
[]
["Diario","Fecha","Asiento","Orden","Cuenta","Importe Pts","Concepto","Documento","Debe","Haber","Moneda","Punteo","TipoIVA","Nº IVA","Depto.","Subdepto.","Imagen"]
[1,"A","#1",1,"J",null,"M",null,"D",null,"R",null,"P","Q"]
[1,"A","#1",2,"K",null,"N",null,null,"H","R",null,"P","Q"]
[1,"A","#1",3,"L",null,"O",null,null,"I","R",null,"P","Q"]
{"$rows_empty":10}
[{"$nulls":7}," "]

{"sheet":"Asto.VentasALMFranquiciasFirme","index":11,"n_rows":37,"n_cols":17,"rows_kept":37}
["Diario","Fecha","Asiento","Orden","Cuenta","Importe Pts","Concepto","Documento","Debe","Haber","Moneda","Punteo","TipoIVA","Nº IVA","Depto.","Subdepto.","Imagen"]
[1,{"v":42058,"d":"4205800.00%"},1,1,4300000092,null,"Clientes. ALM Franq. 92 Tienda 21",null,745.3,null,"E",null,"R",1]
[1,{"v":42058,"d":"4205800.00%"},1,2,7000011121,null,"Vtas. ALM Franq. 92 Tienda 21 Producto 111",null,null,677.55,"E",null,"R",1]
[1,{"v":42058,"d":"4205800.00%"},1,3,4770001000,null,"IVA Rep. ALM Franq. 92 Tienda 21",null,null,67.75,"E",null,"R",1]
[1,{"v":42058,"d":"4205800.00%"},2,1,4300000092,null,"Clientes. ALM Franq. 92 Tienda 22",null,221.3,null,"E",null,"R",2]
[1,{"v":42058,"d":"4205800.00%"},2,2,7000012222,null,"Vtas. ALM Franq. 92 Tienda 22 Producto 122",null,null,182.89,"E",null,"R",2]
[1,{"v":42058,"d":"4205800.00%"},2,3,4770002100,null,"IVA Rep. ALM Franq. 92 Tienda 22",null,null,38.41,"E",null,"R",2]
[1,{"v":42058,"d":"4205800.00%"},3,1,4300000095,null,"Clientes. ALM Franq. 95 Tienda 31",null,247.98,null,"E",null,"R",3]
[1,{"v":42058,"d":"4205800.00%"},3,2,7000011131,null,"Vtas. ALM Franq. 95 Tienda 31 Producto 111",null,null,225.44,"E",null,"R",3]
[1,{"v":42058,"d":"4205800.00%"},3,3,4770001000,null,"IVA Rep. ALM Franq. 95 Tienda 31",null,null,22.54,"E",null,"R",3]
[1,{"v":42058,"d":"4205800.00%"},4,1,4300000096,null,"Clientes. ALM Franq. 96 Tienda 41",null,223.32,null,"E",null,"R",4]
[1,{"v":42058,"d":"4205800.00%"},4,2,7000011141,null,"Vtas. ALM Franq. 96 Tienda 41 Producto 111",null,null,203.02,"E",null,"R",4]
[1,{"v":42058,"d":"4205800.00%"},4,3,4770001000,null,"IVA Rep. ALM Franq. 96 Tienda 41",null,null,20.3,"E",null,"R",4]
[1,{"v":42058,"d":"4205800.00%"},5,1,4300000095,null,"Clientes. ALM Franq. 95 Tienda 43",null,458.88,null,"E",null,"R",5]
[1,{"v":42058,"d":"4205800.00%"},5,2,7000012343,null,"Vtas. ALM Franq. 95 Tienda 43 Producto 123",null,null,379.24,"E",null,"R",5]
[1,{"v":42058,"d":"4205800.00%"},5,3,4770002100,null,"IVA Rep. ALM Franq. 95 Tienda 43",null,null,79.64,"E",null,"R",5]
[1,{"v":42058,"d":"4205800.00%"},6,1,4300000093,null,"Clientes. ALM Franq. 93 Tienda 51",null,888.01,null,"E",null,"R",6]
[1,{"v":42058,"d":"4205800.00%"},6,2,7000011351,null,"Vtas. ALM Franq. 93 Tienda 51 Producto 113",null,null,733.89,"E",null,"R",6]
[1,{"v":42058,"d":"4205800.00%"},6,3,4770002100,null,"IVA Rep. ALM Franq. 93 Tienda 51",null,null,154.12,"E",null,"R",6]
[1,{"v":42058,"d":"4205800.00%"},7,1,4300000095,null,"Clientes. ALM Franq. 95 Tienda 52",null,236.12,null,"E",null,"R",7]
[1,{"v":42058,"d":"4205800.00%"},7,2,7000012352,null,"Vtas. ALM Franq. 95 Tienda 52 Producto 123",null,null,195.14,"E",null,"R",7]
[1,{"v":42058,"d":"4205800.00%"},7,3,4770002100,null,"IVA Rep. ALM Franq. 95 Tienda 52",null,null,40.98,"E",null,"R",7]
[1,{"v":42058,"d":"4205800.00%"},8,1,4300000092,null,"Clientes. ALM Franq. 92 Tienda 55",null,455.11,null,"E",null,"R",8]
[1,{"v":42058,"d":"4205800.00%"},8,2,7000012255,null,"Vtas. ALM Franq. 92 Tienda 55 Producto 122",null,null,376.12,"E",null,"R",8]
[1,{"v":42058,"d":"4205800.00%"},8,3,4770002100,null,"IVA Rep. ALM Franq. 92 Tienda 55",null,null,78.99,"E",null,"R",8]
[1,{"v":42058,"d":"4205800.00%"},9,1,4300000093,null,"Clientes. ALM Franq. 93 Tienda 64",null,98,null,"E",null,"R",9]
[1,{"v":42058,"d":"4205800.00%"},9,2,7000012264,null,"Vtas. ALM Franq. 93 Tienda 64 Producto 122",null,null,80.99,"E",null,"R",9]
[1,{"v":42058,"d":"4205800.00%"},9,3,4770002100,null,"IVA Rep. ALM Franq. 93 Tienda 64",null,null,17.01,"E",null,"R",9]
[1,{"v":42058,"d":"4205800.00%"},10,1,4300000096,null,"Clientes. ALM Franq. 96 Tienda 41",null,311.11,null,"E",null,"R",10]
[1,{"v":42058,"d":"4205800.00%"},10,2,7000011141,null,"Vtas. ALM Franq. 96 Tienda 41 Producto 111",null,null,282.83,"E",null,"R",10]
[1,{"v":42058,"d":"4205800.00%"},10,3,4770001000,null,"IVA Rep. ALM Franq. 96 Tienda 41",null,null,28.28,"E",null,"R",10]
[1,{"v":42058,"d":"4205800.00%"},11,1,4300000095,null,"Clientes. ALM Franq. 95 Tienda 31",null,111.22,null,"E",null,"R",11]
[1,{"v":42058,"d":"4205800.00%"},11,2,7000012231,null,"Vtas. ALM Franq. 95 Tienda 31 Producto 122",null,null,91.92,"E",null,"R",11]
[1,{"v":42058,"d":"4205800.00%"},11,3,4770002100,null,"IVA Rep. ALM Franq. 95 Tienda 31",null,null,19.3,"E",null,"R",11]
[1,{"v":42058,"d":"4205800.00%"},12,1,4300000093,null,"Clientes. ALM Franq. 93 Tienda 64",null,265,null,"E",null,"R",12]
[1,{"v":42058,"d":"4205800.00%"},12,2,7000011364,null,"Vtas. ALM Franq. 93 Tienda 64 Producto 113",null,null,219.01,"E",null,"R",12]
[1,{"v":42058,"d":"4205800.00%"},12,3,4770002100,null,"IVA Rep. ALM Franq. 93 Tienda 64",null,null,45.99,"E",null,"R",12]

{"sheet":"VentasTPVFranquiciasEnFirme","index":12,"n_rows":13,"n_cols":23,"rows_kept":13}
["Fecha","IdTienda","IdFamilia","Ventas (IVA inc.)","F.Pago","Id Tarjeta","% IVA Venta","Venta (Sin IVA)","%Royaltie","Royaltie (Sin IVA)","%IVA Royaltie","IVA Royaltie","Royaltie (Con IVA)","Id Franquiciado","Cta.Deudores,","Cta. Royaltie","Cta. IVA Royaltie","Concepto deudores","Concepto Ing. Royaltie","Concepto IVA Rep.","Moneda","Tipo IVA","Nº IVA"]
[{"v":42058,"d":"4205800.00%"},21,123,558.36,1,null,{"$f":"VLOOKUP(Tabla2[[#This Row],[IdFamilia]],Familias!$A$3:$D$8,3)","v":{"v":0.21,"d":"21.00%"}},{"$f":"ROUND(Tabla2[[#This Row],[Ventas (IVA inc.)]]/(1+G2),2)","v":461.45},{"$f":"VLOOKUP(N2,Franquicias!$A$2:$D$7,4)","v":{"v":0.0175,"d":"1.75%"}},{"$f":"ROUND(H2*I2,2)","v":8.08},{"$f":"Franquicias!$B$13","v":{"v":0.21,"d":"21%"}},{"$f":"ROUND(J2*K2,2)","v":1.7},{"$f":"ROUND(J2+L2,2)","v":9.78},{"$f":"VLOOKUP(B2,Tiendas!$A$2:$F$26,6)","v":92},{"$f":"VLOOKUP(N2,Franquicias!$A$1:$H$7,7)","v":"4400000092"},{"$f":"VLOOKUP(VentasTPVFranquiciasEnFirme!N2,Franquicias!$A$2:$H$7,8)","v":"7050000092"},{"$f":"Franquicias!$C$13","v":"4770002100"},{"$f":"\"Deudores Franq.Firme \"&N2&\" \"&\"Tienda \"&Tabla2[[#This Row],[IdTienda]]","v":"Deudores Franq.Firme 92 Tienda 21"},{"$f":"\"Ing. Royaltie\"&\" \"&\"Franq.Firme \"&N2&\" \"&\"Tienda \"&Tabla2[[#This Row],[IdTienda]]","v":"Ing. Royaltie Franq.Firme 92 Tienda 21"},{"$f":"\"IVA Rep. Franq.Firme \"&N2&\" \"&\"Tienda \"&Tabla2[[#This Row],[IdTienda]]","v":"IVA Rep. Franq.Firme 92 Tienda 21"},"E","R",1]
[{"v":42058,"d":"4205800.00%"},22,111,1112.25,1,null,{"$f":"VLOOKUP(Tabla2[[#This Row],[IdFamilia]],Familias!$A$3:$D$8,3)","v":{"v":0.1,"d":"10.00%"}},{"$f":"ROUND(Tabla2[[#This Row],[Ventas (IVA inc.)]]/(1+G3),2)","v":1011.14},{"$f":"VLOOKUP(N3,Franquicias!$A$2:$D$7,4)","v":{"v":0.0175,"d":"1.75%"}},{"$f":"ROUND(H3*I3,2)","v":17.69},{"$f":"Franquicias!$B$13","v":{"v":0.21,"d":"21%"}},{"$f":"ROUND(J3*K3,2)","v":3.71},{"$f":"ROUND(J3+L3,2)","v":21.4},{"$f":"VLOOKUP(B3,Tiendas!$A$2:$F$26,6)","v":92},{"$f":"VLOOKUP(N3,Franquicias!$A$1:$H$7,7)","v":"4400000092"},{"$f":"VLOOKUP(VentasTPVFranquiciasEnFirme!N3,Franquicias!$A$2:$H$7,8)","v":"7050000092"},{"$f":"Franquicias!$C$13","v":"4770002100"},{"$f":"\"Deudores Franq.Firme \"&N3&\" \"&\"Tienda \"&Tabla2[[#This Row],[IdTienda]]","v":"Deudores Franq.Firme 92 Tienda 22"},{"$f":"\"Ing. Royaltie\"&\" \"&\"Franq.Firme \"&N3&\" \"&\"Tienda \"&Tabla2[[#This Row],[IdTienda]]","v":"Ing. Royaltie Franq.Firme 92 Tienda 22"},{"$f":"\"IVA Rep. Franq.Firme \"&N3&\" \"&\"Tienda \"&Tabla2[[#This Row],[IdTienda]]","v":"IVA Rep. Franq.Firme 92 Tienda 22"},"E","R",{"$f":"W2+1","v":2}]
[{"v":42058,"d":"4205800.00%"},31,112,125,2,2,{"$f":"VLOOKUP(Tabla2[[#This Row],[IdFamilia]],Familias!$A$3:$D$8,3)","v":{"v":0.04,"d":"4.00%"}},{"$f":"ROUND(Tabla2[[#This Row],[Ventas (IVA inc.)]]/(1+G4),2)","v":120.19},{"$f":"VLOOKUP(N4,Franquicias!$A$2:$D$7,4)","v":{"v":0.015,"d":"1.50%"}},1.8,{"$f":"Franquicias!$B$13","v":{"v":0.21,"d":"21%"}},0.38,2.18,{"$f":"VLOOKUP(B4,Tiendas!$A$2:$F$26,6)","v":95},{"$f":"VLOOKUP(N4,Franquicias!$A$1:$H$7,7)","v":"4400000095"},{"$f":"VLOOKUP(VentasTPVFranquiciasEnFirme!N4,Franquicias!$A$2:$H$7,8)","v":"7050000095"},{"$f":"Franquicias!$C$13","v":"4770002100"},{"$f":"\"Deudores Franq.Firme \"&N4&\" \"&\"Tienda \"&Tabla2[[#This Row],[IdTienda]]","v":"Deudores Franq.Firme 95 Tienda 31"},{"$f":"\"Ing. Royaltie\"&\" \"&\"Franq.Firme \"&N4&\" \"&\"Tienda \"&Tabla2[[#This Row],[IdTienda]]","v":"Ing. Royaltie Franq.Firme 95 Tienda 31"},{"$f":"\"IVA Rep. Franq.Firme \"&N4&\" \"&\"Tienda \"&Tabla2[[#This Row],[IdTienda]]","v":"IVA Rep. Franq.Firme 95 Tienda 31"},"E","R",{"$f":"W3+1","v":3}]
[{"v":42058,"d":"4205800.00%"},41,121,221.5,1,null,{"$f":"VLOOKUP(Tabla2[[#This Row],[IdFamilia]],Familias!$A$3:$D$8,3)","v":{"v":0.21,"d":"21.00%"}},{"$f":"ROUND(Tabla2[[#This Row],[Ventas (IVA inc.)]]/(1+G5),2)","v":183.06},{"$f":"VLOOKUP(N5,Franquicias!$A$2:$D$7,4)","v":{"v":0.02,"d":"2.00%"}},3.66,{"$f":"Franquicias!$B$13","v":{"v":0.21,"d":"21%"}},0.77,4.43,{"$f":"VLOOKUP(B5,Tiendas!$A$2:$F$26,6)","v":96},{"$f":"VLOOKUP(N5,Franquicias!$A$1:$H$7,7)","v":"4400000096"},{"$f":"VLOOKUP(VentasTPVFranquiciasEnFirme!N5,Franquicias!$A$2:$H$7,8)","v":"7050000096"},{"$f":"Franquicias!$C$13","v":"4770002100"},{"$f":"\"Deudores Franq.Firme \"&N5&\" \"&\"Tienda \"&Tabla2[[#This Row],[IdTienda]]","v":"Deudores Franq.Firme 96 Tienda 41"},{"$f":"\"Ing. Royaltie\"&\" \"&\"Franq.Firme \"&N5&\" \"&\"Tienda \"&Tabla2[[#This Row],[IdTienda]]","v":"Ing. Royaltie Franq.Firme 96 Tienda 41"},{"$f":"\"IVA Rep. Franq.Firme \"&N5&\" \"&\"Tienda \"&Tabla2[[#This Row],[IdTienda]]","v":"IVA Rep. Franq.Firme 96 Tienda 41"},"E","R",4]
[{"v":42058,"d":"4205800.00%"},43,122,447,2,3,{"$f":"VLOOKUP(Tabla2[[#This Row],[IdFamilia]],Familias!$A$3:$D$8,3)","v":{"v":0.21,"d":"21.00%"}},{"$f":"ROUND(Tabla2[[#This Row],[Ventas (IVA inc.)]]/(1+G6),2)","v":369.42},{"$f":"VLOOKUP(N6,Franquicias!$A$2:$D$7,4)","v":{"v":0.015,"d":"1.50%"}},5.54,{"$f":"Franquicias!$B$13","v":{"v":0.21,"d":"21%"}},1.16,6.7,{"$f":"VLOOKUP(B6,Tiendas!$A$2:$F$26,6)","v":95},{"$f":"VLOOKUP(N6,Franquicias!$A$1:$H$7,7)","v":"4400000095"},{"$f":"VLOOKUP(VentasTPVFranquiciasEnFirme!N6,Franquicias!$A$2:$H$7,8)","v":"7050000095"},{"$f":"Franquicias!$C$13","v":"4770002100"},{"$f":"\"Deudores Franq.Firme \"&N6&\" \"&\"Tienda \"&Tabla2[[#This Row],[IdTienda]]","v":"Deudores Franq.Firme 95 Tienda 43"},{"$f":"\"Ing. Royaltie\"&\" \"&\"Franq.Firme \"&N6&\" \"&\"Tienda \"&Tabla2[[#This Row],[IdTienda]]","v":"Ing. Royaltie Franq.Firme 95 Tienda 43"},{"$f":"\"IVA Rep. Franq.Firme \"&N6&\" \"&\"Tienda \"&Tabla2[[#This Row],[IdTienda]]","v":"IVA Rep. Franq.Firme 95 Tienda 43"},"E","R",5]
[{"v":42058,"d":"4205800.00%"},51,113,265.02,2,1,{"$f":"VLOOKUP(Tabla2[[#This Row],[IdFamilia]],Familias!$A$3:$D$8,3)","v":{"v":0.21,"d":"21.00%"}},{"$f":"ROUND(Tabla2[[#This Row],[Ventas (IVA inc.)]]/(1+G7),2)","v":219.02},{"$f":"VLOOKUP(N7,Franquicias!$A$2:$D$7,4)","v":{"v":0.015,"d":"1.50%"}},3.29,{"$f":"Franquicias!$B$13","v":{"v":0.21,"d":"21%"}},0.69,3.98,{"$f":"VLOOKUP(B7,Tiendas!$A$2:$F$26,6)","v":93},{"$f":"VLOOKUP(N7,Franquicias!$A$1:$H$7,7)","v":"4400000093"},{"$f":"VLOOKUP(VentasTPVFranquiciasEnFirme!N7,Franquicias!$A$2:$H$7,8)","v":"7050000093"},{"$f":"Franquicias!$C$13","v":"4770002100"},{"$f":"\"Deudores Franq.Firme \"&N7&\" \"&\"Tienda \"&Tabla2[[#This Row],[IdTienda]]","v":"Deudores Franq.Firme 93 Tienda 51"},{"$f":"\"Ing. Royaltie\"&\" \"&\"Franq.Firme \"&N7&\" \"&\"Tienda \"&Tabla2[[#This Row],[IdTienda]]","v":"Ing. Royaltie Franq.Firme 93 Tienda 51"},{"$f":"\"IVA Rep. Franq.Firme \"&N7&\" \"&\"Tienda \"&Tabla2[[#This Row],[IdTienda]]","v":"IVA Rep. Franq.Firme 93 Tienda 51"},"E","R",6]
[{"v":42058,"d":"4205800.00%"},52,111,36.32,1,null,{"$f":"VLOOKUP(Tabla2[[#This Row],[IdFamilia]],Familias!$A$3:$D$8,3)","v":{"v":0.1,"d":"10.00%"}},{"$f":"ROUND(Tabla2[[#This Row],[Ventas (IVA inc.)]]/(1+G8),2)","v":33.02},{"$f":"VLOOKUP(N8,Franquicias!$A$2:$D$7,4)","v":{"v":0.015,"d":"1.50%"}},0.5,{"$f":"Franquicias!$B$13","v":{"v":0.21,"d":"21%"}},0.11,0.61,{"$f":"VLOOKUP(B8,Tiendas!$A$2:$F$26,6)","v":95},{"$f":"VLOOKUP(N8,Franquicias!$A$1:$H$7,7)","v":"4400000095"},{"$f":"VLOOKUP(VentasTPVFranquiciasEnFirme!N8,Franquicias!$A$2:$H$7,8)","v":"7050000095"},{"$f":"Franquicias!$C$13","v":"4770002100"},{"$f":"\"Deudores Franq.Firme \"&N8&\" \"&\"Tienda \"&Tabla2[[#This Row],[IdTienda]]","v":"Deudores Franq.Firme 95 Tienda 52"},{"$f":"\"Ing. Royaltie\"&\" \"&\"Franq.Firme \"&N8&\" \"&\"Tienda \"&Tabla2[[#This Row],[IdTienda]]","v":"Ing. Royaltie Franq.Firme 95 Tienda 52"},{"$f":"\"IVA Rep. Franq.Firme \"&N8&\" \"&\"Tienda \"&Tabla2[[#This Row],[IdTienda]]","v":"IVA Rep. Franq.Firme 95 Tienda 52"},"E","R",7]
[{"v":42058,"d":"4205800.00%"},55,112,122,1,null,{"$f":"VLOOKUP(Tabla2[[#This Row],[IdFamilia]],Familias!$A$3:$D$8,3)","v":{"v":0.04,"d":"4.00%"}},{"$f":"ROUND(Tabla2[[#This Row],[Ventas (IVA inc.)]]/(1+G9),2)","v":117.31},{"$f":"VLOOKUP(N9,Franquicias!$A$2:$D$7,4)","v":{"v":0.0175,"d":"1.75%"}},2.05,{"$f":"Franquicias!$B$13","v":{"v":0.21,"d":"21%"}},0.43,2.48,{"$f":"VLOOKUP(B9,Tiendas!$A$2:$F$26,6)","v":92},{"$f":"VLOOKUP(N9,Franquicias!$A$1:$H$7,7)","v":"4400000092"},{"$f":"VLOOKUP(VentasTPVFranquiciasEnFirme!N9,Franquicias!$A$2:$H$7,8)","v":"7050000092"},{"$f":"Franquicias!$C$13","v":"4770002100"},{"$f":"\"Deudores Franq.Firme \"&N9&\" \"&\"Tienda \"&Tabla2[[#This Row],[IdTienda]]","v":"Deudores Franq.Firme 92 Tienda 55"},{"$f":"\"Ing. Royaltie\"&\" \"&\"Franq.Firme \"&N9&\" \"&\"Tienda \"&Tabla2[[#This Row],[IdTienda]]","v":"Ing. Royaltie Franq.Firme 92 Tienda 55"},{"$f":"\"IVA Rep. Franq.Firme \"&N9&\" \"&\"Tienda \"&Tabla2[[#This Row],[IdTienda]]","v":"IVA Rep. Franq.Firme 92 Tienda 55"},"E","R",8]
[{"v":42058,"d":"4205800.00%"},64,122,14.23,1,null,{"$f":"VLOOKUP(Tabla2[[#This Row],[IdFamilia]],Familias!$A$3:$D$8,3)","v":{"v":0.21,"d":"21.00%"}},{"$f":"ROUND(Tabla2[[#This Row],[Ventas (IVA inc.)]]/(1+G10),2)","v":11.76},{"$f":"VLOOKUP(N10,Franquicias!$A$2:$D$7,4)","v":{"v":0.015,"d":"1.50%"}},0.18,{"$f":"Franquicias!$B$13","v":{"v":0.21,"d":"21%"}},0.04,0.22,{"$f":"VLOOKUP(B10,Tiendas!$A$2:$F$26,6)","v":93},{"$f":"VLOOKUP(N10,Franquicias!$A$1:$H$7,7)","v":"4400000093"},{"$f":"VLOOKUP(VentasTPVFranquiciasEnFirme!N10,Franquicias!$A$2:$H$7,8)","v":"7050000093"},{"$f":"Franquicias!$C$13","v":"4770002100"},{"$f":"\"Deudores Franq.Firme \"&N10&\" \"&\"Tienda \"&Tabla2[[#This Row],[IdTienda]]","v":"Deudores Franq.Firme 93 Tienda 64"},{"$f":"\"Ing. Royaltie\"&\" \"&\"Franq.Firme \"&N10&\" \"&\"Tienda \"&Tabla2[[#This Row],[IdTienda]]","v":"Ing. Royaltie Franq.Firme 93 Tienda 64"},{"$f":"\"IVA Rep. Franq.Firme \"&N10&\" \"&\"Tienda \"&Tabla2[[#This Row],[IdTienda]]","v":"IVA Rep. Franq.Firme 93 Tienda 64"},"E","R",9]
[{"v":42058,"d":"4205800.00%"},41,121,33.65,1,null,{"$f":"VLOOKUP(Tabla2[[#This Row],[IdFamilia]],Familias!$A$3:$D$8,3)","v":{"v":0.21,"d":"21.00%"}},{"$f":"ROUND(Tabla2[[#This Row],[Ventas (IVA inc.)]]/(1+G11),2)","v":27.81},{"$f":"VLOOKUP(N11,Franquicias!$A$2:$D$7,4)","v":{"v":0.02,"d":"2.00%"}},0.56,{"$f":"Franquicias!$B$13","v":{"v":0.21,"d":"21%"}},0.12,0.68,{"$f":"VLOOKUP(B11,Tiendas!$A$2:$F$26,6)","v":96},{"$f":"VLOOKUP(N11,Franquicias!$A$1:$H$7,7)","v":"4400000096"},{"$f":"VLOOKUP(VentasTPVFranquiciasEnFirme!N11,Franquicias!$A$2:$H$7,8)","v":"7050000096"},{"$f":"Franquicias!$C$13","v":"4770002100"},{"$f":"\"Deudores Franq.Firme \"&N11&\" \"&\"Tienda \"&Tabla2[[#This Row],[IdTienda]]","v":"Deudores Franq.Firme 96 Tienda 41"},{"$f":"\"Ing. Royaltie\"&\" \"&\"Franq.Firme \"&N11&\" \"&\"Tienda \"&Tabla2[[#This Row],[IdTienda]]","v":"Ing. Royaltie Franq.Firme 96 Tienda 41"},{"$f":"\"IVA Rep. Franq.Firme \"&N11&\" \"&\"Tienda \"&Tabla2[[#This Row],[IdTienda]]","v":"IVA Rep. Franq.Firme 96 Tienda 41"},"E","R",10]
[{"v":42058,"d":"4205800.00%"},31,123,258.36,2,1,{"$f":"VLOOKUP(Tabla2[[#This Row],[IdFamilia]],Familias!$A$3:$D$8,3)","v":{"v":0.21,"d":"21.00%"}},{"$f":"ROUND(Tabla2[[#This Row],[Ventas (IVA inc.)]]/(1+G12),2)","v":213.52},{"$f":"VLOOKUP(N12,Franquicias!$A$2:$D$7,4)","v":{"v":0.015,"d":"1.50%"}},3.2,{"$f":"Franquicias!$B$13","v":{"v":0.21,"d":"21%"}},0.67,3.87,{"$f":"VLOOKUP(B12,Tiendas!$A$2:$F$26,6)","v":95},{"$f":"VLOOKUP(N12,Franquicias!$A$1:$H$7,7)","v":"4400000095"},{"$f":"VLOOKUP(VentasTPVFranquiciasEnFirme!N12,Franquicias!$A$2:$H$7,8)","v":"7050000095"},{"$f":"Franquicias!$C$13","v":"4770002100"},{"$f":"\"Deudores Franq.Firme \"&N12&\" \"&\"Tienda \"&Tabla2[[#This Row],[IdTienda]]","v":"Deudores Franq.Firme 95 Tienda 31"},{"$f":"\"Ing. Royaltie\"&\" \"&\"Franq.Firme \"&N12&\" \"&\"Tienda \"&Tabla2[[#This Row],[IdTienda]]","v":"Ing. Royaltie Franq.Firme 95 Tienda 31"},{"$f":"\"IVA Rep. Franq.Firme \"&N12&\" \"&\"Tienda \"&Tabla2[[#This Row],[IdTienda]]","v":"IVA Rep. Franq.Firme 95 Tienda 31"},"E","R",11]
[{"v":42058,"d":"4205800.00%"},64,112,985,1,null,{"$f":"VLOOKUP(Tabla2[[#This Row],[IdFamilia]],Familias!$A$3:$D$8,3)","v":{"v":0.04,"d":"4.00%"}},{"$f":"ROUND(Tabla2[[#This Row],[Ventas (IVA inc.)]]/(1+G13),2)","v":947.12},{"$f":"VLOOKUP(N13,Franquicias!$A$2:$D$7,4)","v":{"v":0.015,"d":"1.50%"}},14.21,{"$f":"Franquicias!$B$13","v":{"v":0.21,"d":"21%"}},2.98,17.19,{"$f":"VLOOKUP(B13,Tiendas!$A$2:$F$26,6)","v":93},{"$f":"VLOOKUP(N13,Franquicias!$A$1:$H$7,7)","v":"4400000093"},{"$f":"VLOOKUP(VentasTPVFranquiciasEnFirme!N13,Franquicias!$A$2:$H$7,8)","v":"7050000093"},{"$f":"Franquicias!$C$13","v":"4770002100"},{"$f":"\"Deudores Franq.Firme \"&N13&\" \"&\"Tienda \"&Tabla2[[#This Row],[IdTienda]]","v":"Deudores Franq.Firme 93 Tienda 64"},{"$f":"\"Ing. Royaltie\"&\" \"&\"Franq.Firme \"&N13&\" \"&\"Tienda \"&Tabla2[[#This Row],[IdTienda]]","v":"Ing. Royaltie Franq.Firme 93 Tienda 64"},{"$f":"\"IVA Rep. Franq.Firme \"&N13&\" \"&\"Tienda \"&Tabla2[[#This Row],[IdTienda]]","v":"IVA Rep. Franq.Firme 93 Tienda 64"},"E","R",12]

{"sheet":"ConfigVentasTPVFranqFirme","index":13,"n_rows":23,"n_cols":17,"rows_kept":23,"merged":[[0,3,0,5],[1,3,1,5]]}
["Hoja con los datos de entrada:",null,null,"VentasTPVFranquiciasEnFirme"]
["Datos de salida:",null,null,"AstosVentasTPVFranquiciasFirme"]
["Primer número de asiento:",null,null,1]
["Procedimientos a ejecutar previamente:",{"$nulls":3},"Macro3","Macro4"]
[]
[]
[]
[]
["Diario","Fecha","Asiento","Orden","Cuenta","Importe Pts","Concepto","Documento","Debe","Haber","Moneda","Punteo","TipoIVA","Nº IVA","Depto.","Subdepto.","Imagen"]
[1,"A","#1",1,"O",null,"R",null,"M",null,"U",null,"V","W"]
[1,"A","#1",2,"P",null,"S",null,null,"J","U",null,"V","W"]
[1,"A","#1",3,"Q",null,"T",null,null,"L","U",null,"V","W"]
{"$rows_empty":10}
[{"$nulls":7}," "]

{"sheet":"AstosVentasTPVFranquiciasFirme","index":14,"n_rows":37,"n_cols":17,"rows_kept":37}
["Diario","Fecha","Asiento","Orden","Cuenta","Importe Pts","Concepto","Documento","Debe","Haber","Moneda","Punteo","TipoIVA","Nº IVA","Depto.","Subdepto.","Imagen"]
[1,{"v":42058,"d":"4205800.00%"},1,1,4400000092,null,"Deudores Franq.Firme 92 Tienda 21",null,9.78,null,"E",null,"R",1]
[1,{"v":42058,"d":"4205800.00%"},1,2,7050000092,null,"Ing. Royaltie Franq.Firme 92 Tienda 21",null,null,8.08,"E",null,"R",1]
[1,{"v":42058,"d":"4205800.00%"},1,3,4770002100,null,"IVA Rep. Franq.Firme 92 Tienda 21",null,null,1.7,"E",null,"R",1]
[1,{"v":42058,"d":"4205800.00%"},2,1,4400000092,null,"Deudores Franq.Firme 92 Tienda 22",null,21.4,null,"E",null,"R",2]
[1,{"v":42058,"d":"4205800.00%"},2,2,7050000092,null,"Ing. Royaltie Franq.Firme 92 Tienda 22",null,null,17.69,"E",null,"R",2]
[1,{"v":42058,"d":"4205800.00%"},2,3,4770002100,null,"IVA Rep. Franq.Firme 92 Tienda 22",null,null,3.71,"E",null,"R",2]
[1,{"v":42058,"d":"4205800.00%"},3,1,4400000095,null,"Deudores Franq.Firme 95 Tienda 31",null,2.18,null,"E",null,"R",3]
[1,{"v":42058,"d":"4205800.00%"},3,2,7050000095,null,"Ing. Royaltie Franq.Firme 95 Tienda 31",null,null,1.8,"E",null,"R",3]
[1,{"v":42058,"d":"4205800.00%"},3,3,4770002100,null,"IVA Rep. Franq.Firme 95 Tienda 31",null,null,0.38,"E",null,"R",3]
[1,{"v":42058,"d":"4205800.00%"},4,1,4400000096,null,"Deudores Franq.Firme 96 Tienda 41",null,4.43,null,"E",null,"R",4]
[1,{"v":42058,"d":"4205800.00%"},4,2,7050000096,null,"Ing. Royaltie Franq.Firme 96 Tienda 41",null,null,3.66,"E",null,"R",4]
[1,{"v":42058,"d":"4205800.00%"},4,3,4770002100,null,"IVA Rep. Franq.Firme 96 Tienda 41",null,null,0.77,"E",null,"R",4]
[1,{"v":42058,"d":"4205800.00%"},5,1,4400000095,null,"Deudores Franq.Firme 95 Tienda 43",null,6.7,null,"E",null,"R",5]
[1,{"v":42058,"d":"4205800.00%"},5,2,7050000095,null,"Ing. Royaltie Franq.Firme 95 Tienda 43",null,null,5.54,"E",null,"R",5]
[1,{"v":42058,"d":"4205800.00%"},5,3,4770002100,null,"IVA Rep. Franq.Firme 95 Tienda 43",null,null,1.16,"E",null,"R",5]
[1,{"v":42058,"d":"4205800.00%"},6,1,4400000093,null,"Deudores Franq.Firme 93 Tienda 51",null,3.98,null,"E",null,"R",6]
[1,{"v":42058,"d":"4205800.00%"},6,2,7050000093,null,"Ing. Royaltie Franq.Firme 93 Tienda 51",null,null,3.29,"E",null,"R",6]
[1,{"v":42058,"d":"4205800.00%"},6,3,4770002100,null,"IVA Rep. Franq.Firme 93 Tienda 51",null,null,0.69,"E",null,"R",6]
[1,{"v":42058,"d":"4205800.00%"},7,1,4400000095,null,"Deudores Franq.Firme 95 Tienda 52",null,0.61,null,"E",null,"R",7]
[1,{"v":42058,"d":"4205800.00%"},7,2,7050000095,null,"Ing. Royaltie Franq.Firme 95 Tienda 52",null,null,0.5,"E",null,"R",7]
[1,{"v":42058,"d":"4205800.00%"},7,3,4770002100,null,"IVA Rep. Franq.Firme 95 Tienda 52",null,null,0.11,"E",null,"R",7]
[1,{"v":42058,"d":"4205800.00%"},8,1,4400000092,null,"Deudores Franq.Firme 92 Tienda 55",null,2.48,null,"E",null,"R",8]
[1,{"v":42058,"d":"4205800.00%"},8,2,7050000092,null,"Ing. Royaltie Franq.Firme 92 Tienda 55",null,null,2.05,"E",null,"R",8]
[1,{"v":42058,"d":"4205800.00%"},8,3,4770002100,null,"IVA Rep. Franq.Firme 92 Tienda 55",null,null,0.43,"E",null,"R",8]
[1,{"v":42058,"d":"4205800.00%"},9,1,4400000093,null,"Deudores Franq.Firme 93 Tienda 64",null,0.22,null,"E",null,"R",9]
[1,{"v":42058,"d":"4205800.00%"},9,2,7050000093,null,"Ing. Royaltie Franq.Firme 93 Tienda 64",null,null,0.18,"E",null,"R",9]
[1,{"v":42058,"d":"4205800.00%"},9,3,4770002100,null,"IVA Rep. Franq.Firme 93 Tienda 64",null,null,0.04,"E",null,"R",9]
[1,{"v":42058,"d":"4205800.00%"},10,1,4400000096,null,"Deudores Franq.Firme 96 Tienda 41",null,0.68,null,"E",null,"R",10]
[1,{"v":42058,"d":"4205800.00%"},10,2,7050000096,null,"Ing. Royaltie Franq.Firme 96 Tienda 41",null,null,0.56,"E",null,"R",10]
[1,{"v":42058,"d":"4205800.00%"},10,3,4770002100,null,"IVA Rep. Franq.Firme 96 Tienda 41",null,null,0.12,"E",null,"R",10]
[1,{"v":42058,"d":"4205800.00%"},11,1,4400000095,null,"Deudores Franq.Firme 95 Tienda 31",null,3.87,null,"E",null,"R",11]
[1,{"v":42058,"d":"4205800.00%"},11,2,7050000095,null,"Ing. Royaltie Franq.Firme 95 Tienda 31",null,null,3.2,"E",null,"R",11]
[1,{"v":42058,"d":"4205800.00%"},11,3,4770002100,null,"IVA Rep. Franq.Firme 95 Tienda 31",null,null,0.67,"E",null,"R",11]
[1,{"v":42058,"d":"4205800.00%"},12,1,4400000093,null,"Deudores Franq.Firme 93 Tienda 64",null,17.19,null,"E",null,"R",12]
[1,{"v":42058,"d":"4205800.00%"},12,2,7050000093,null,"Ing. Royaltie Franq.Firme 93 Tienda 64",null,null,14.21,"E",null,"R",12]
[1,{"v":42058,"d":"4205800.00%"},12,3,4770002100,null,"IVA Rep. Franq.Firme 93 Tienda 64",null,null,2.98,"E",null,"R",12]

{"sheet":"ConfigVentasFranqDepósito","index":15,"n_rows":23,"n_cols":17,"rows_kept":23,"merged":[[0,3,0,5],[1,3,1,5]]}
["Hoja con los datos de entrada:",null,null,"VentasTPVFranquiciasEnDepósito"]
["Datos de salida:",null,null,"AstosVentasTPVFranqDepósito"]
["Primer número de asiento:",null,null,1]
["Procedimientos a ejecutar previamente:",{"$nulls":3},"Macro5","Macro6"]
[]
[]
[]
[]
["Diario","Fecha","Asiento","Orden","Cuenta","Importe Pts","Concepto","Documento","Debe","Haber","Moneda","Punteo","TipoIVA","Nº IVA","Depto.","Subdepto.","Imagen"]
[1,"A","#1",1,"R",null,"X",null,"H",null,"AD",null,"AE","AF"]
[1,"A","#1",2,"T",null,"Y",null,null,"J","AD",null,"AE","AF"]
[1,"A","#1",3,"U",null,"Z",null,null,"K","AD",null,"AE","AF"]
[1,"A","#2",1,"S",null,"AA",null,"O",null,"AD",null,"AE","AF"]
[1,"A","#2",2,"V",null,"AB",null,null,"M","AD",null,"AE","AF"]
[1,"A","#2",3,"W",null,"AC",null,null,"P","AD",null,"AE","AF"]
{"$rows_empty":7}
[{"$nulls":7}," "]

{"sheet":"VentasTPVFranquiciasEnDepósito","index":16,"n_rows":13,"n_cols":32,"rows_kept":13}
["Fecha","IdTienda","IdFamilia","Venta (IVA Inc.)","F.Pago","Id Tarjeta","Venta (Sin IVA)","% Venta (Con IVA)","IVA Venta","% Venta (Sin IVA)","IVA Venta del %","% Royaltie","Imp. Royaltie (Sin IVA)","% IVA Royaltie","Imp Royaltie (Con IVA)","Imp. IVA Royaltie","Id franquiciado","Cta. Cliente","Cta. Deudores","Cta. Ventas","Cta. IVA Venta","Cta. Royaltie","Cta. IVA Royaltie","Concepto clientes","Concepto Ventas","Conp. IVA Venta","Concepto Deudores Royaltie","Concepto Royaltie","Conp. IVA Royaltie","Moneda","Tipo IVA","nº IVA"]
[{"v":42058,"d":"4205800.00%"},12,122,632.22,1,null,{"$f":"ROUND(Tabla3[[#This Row],[Venta (IVA Inc.)]]/(1+I2),2)","v":522.5},{"$f":"ROUND(D2*VLOOKUP(Q2,Franquicias!$A$2:$E$7,5),2)","v":505.78},{"$f":"VLOOKUP(C2,Familias!$A$3:$C$8,3)","v":{"v":0.21,"d":"21.00%"}},{"$f":"ROUND(H2/(1+I2),2)","v":418},{"$f":"ROUND(H2-J2,2)","v":87.78},{"$f":"VLOOKUP(Q2,Franquicias!$A$2:$H$7,4)","v":{"v":0.02,"d":"2.00%"}},{"$f":"ROUND(G2*L2,2)","v":10.45},{"$f":"Franquicias!$B$13","v":{"v":0.21,"d":"21%"}},{"$f":"ROUND(M2*(1+N2),2)","v":12.64},{"$f":"ROUND(O2-M2,2)","v":2.19},{"$f":"VLOOKUP(B2,Tiendas!$A$2:$F$26,6)","v":91},{"$f":"VLOOKUP(Q2,Franquicias!$A$2:$H$7,6)","v":"4300000091"},{"$f":"VLOOKUP(Q2,Franquicias!$A$2:$H$7,7)","v":"4400000091"},{"$f":"\"70000\"&C2&B2","v":"7000012212"},{"$f":"VLOOKUP(C2,Familias!$A$3:$D$8,4)","v":"4770002100"},{"$f":"VLOOKUP(Q2,Franquicias!$A$2:$H$7,8)","v":"7050000091"},{"$f":"Franquicias!$C$13","v":"4770002100"},{"$f":"\"Clientes Franq. D \"&Q2&\" \"&\"Tienda \"&Tabla3[[#This Row],[IdTienda]]","v":"Clientes Franq. D 91 Tienda 12"},{"$f":"\"Vtas. Franq. D \"&Q2&\" \"&\"Tienda \"&Tabla3[[#This Row],[IdTienda]]&\" Producto \"&Tabla3[[#This Row],[IdFamilia]]","v":"Vtas. Franq. D 91 Tienda 12 Producto 122"},{"$f":"\"IVA Rep. Venta Franq. D \"&Q2&\" \"&\"Tienda \"&Tabla3[[#This Row],[IdTienda]]","v":"IVA Rep. Venta Franq. D 91 Tienda 12"},{"$f":"\"Deudores Franq.D \"&Q2&\" Tienda \"&Tabla3[[#This Row],[IdTienda]]","v":"Deudores Franq.D 91 Tienda 12"},{"$f":"\"Ing. Royaltie Franq. D \"&Q2&\" \"&\"Tienda \"&Tabla3[[#This Row],[IdTienda]]","v":"Ing. Royaltie Franq. D 91 Tienda 12"},{"$f":"\"IVA Rep. Venta Franq. D \"&Q2&\" \"&\"Tienda \"&Tabla3[[#This Row],[IdTienda]]","v":"IVA Rep. Venta Franq. D 91 Tienda 12"},"E","R",1]
[{"v":42058,"d":"4205800.00%"},14,123,145.26,1,null,{"$f":"ROUND(Tabla3[[#This Row],[Venta (IVA Inc.)]]/(1+I3),2)","v":120.05},{"$f":"ROUND(D3*VLOOKUP(Q3,Franquicias!$A$2:$E$7,5),2)","v":116.21},{"$f":"VLOOKUP(C3,Familias!$A$3:$C$8,3)","v":{"v":0.21,"d":"21.00%"}},{"$f":"ROUND(H3/(1+I3),2)","v":96.04},{"$f":"ROUND(H3-J3,2)","v":20.17},{"$f":"VLOOKUP(Q3,Franquicias!$A$2:$H$7,4)","v":{"v":0.02,"d":"2.00%"}},{"$f":"ROUND(G3*L3,2)","v":2.4},{"$f":"Franquicias!$B$13","v":{"v":0.21,"d":"21%"}},{"$f":"ROUND(M3*(1+N3),2)","v":2.9},{"$f":"ROUND(O3-M3,2)","v":0.5},{"$f":"VLOOKUP(B3,Tiendas!$A$2:$F$26,6)","v":91},{"$f":"VLOOKUP(Q3,Franquicias!$A$2:$H$7,6)","v":"4300000091"},{"$f":"VLOOKUP(Q3,Franquicias!$A$2:$H$7,7)","v":"4400000091"},{"$f":"\"70000\"&C3&B3","v":"7000012314"},{"$f":"VLOOKUP(C3,Familias!$A$3:$D$8,4)","v":"4770002100"},{"$f":"VLOOKUP(Q3,Franquicias!$A$2:$H$7,8)","v":"7050000091"},{"$f":"Franquicias!$C$13","v":"4770002100"},{"$f":"\"Clientes Franq. D \"&Q3&\" \"&\"Tienda \"&Tabla3[[#This Row],[IdTienda]]","v":"Clientes Franq. D 91 Tienda 14"},{"$f":"\"Vtas. Franq. D \"&Q3&\" \"&\"Tienda \"&Tabla3[[#This Row],[IdTienda]]&\" Producto \"&Tabla3[[#This Row],[IdFamilia]]","v":"Vtas. Franq. D 91 Tienda 14 Producto 123"},{"$f":"\"IVA Rep. Venta Franq. D \"&Q3&\" \"&\"Tienda \"&Tabla3[[#This Row],[IdTienda]]","v":"IVA Rep. Venta Franq. D 91 Tienda 14"},{"$f":"\"Deudores Franq.D \"&Q3&\" Tienda \"&Tabla3[[#This Row],[IdTienda]]","v":"Deudores Franq.D 91 Tienda 14"},{"$f":"\"Ing. Royaltie Franq. D \"&Q3&\" \"&\"Tienda \"&Tabla3[[#This Row],[IdTienda]]","v":"Ing. Royaltie Franq. D 91 Tienda 14"},{"$f":"\"IVA Rep. Venta Franq. D \"&Q3&\" \"&\"Tienda \"&Tabla3[[#This Row],[IdTienda]]","v":"IVA Rep. Venta Franq. D 91 Tienda 14"},"E","R",{"$f":"AF2+1","v":2}]
[{"v":42058,"d":"4205800.00%"},12,111,333.22,1,null,{"$f":"ROUND(Tabla3[[#This Row],[Venta (IVA Inc.)]]/(1+I4),2)","v":302.93},{"$f":"ROUND(D4*VLOOKUP(Q4,Franquicias!$A$2:$E$7,5),2)","v":266.58},{"$f":"VLOOKUP(C4,Familias!$A$3:$C$8,3)","v":{"v":0.1,"d":"10.00%"}},{"$f":"ROUND(H4/(1+I4),2)","v":242.35},{"$f":"ROUND(H4-J4,2)","v":24.23},{"$f":"VLOOKUP(Q4,Franquicias!$A$2:$H$7,4)","v":{"v":0.02,"d":"2.00%"}},{"$f":"ROUND(G4*L4,2)","v":6.06},{"$f":"Franquicias!$B$13","v":{"v":0.21,"d":"21%"}},{"$f":"ROUND(M4*(1+N4),2)","v":7.33},{"$f":"ROUND(O4-M4,2)","v":1.27},{"$f":"VLOOKUP(B4,Tiendas!$A$2:$F$26,6)","v":91},{"$f":"VLOOKUP(Q4,Franquicias!$A$2:$H$7,6)","v":"4300000091"},{"$f":"VLOOKUP(Q4,Franquicias!$A$2:$H$7,7)","v":"4400000091"},{"$f":"\"70000\"&C4&B4","v":"7000011112"},{"$f":"VLOOKUP(C4,Familias!$A$3:$D$8,4)","v":"4770001000"},{"$f":"VLOOKUP(Q4,Franquicias!$A$2:$H$7,8)","v":"7050000091"},{"$f":"Franquicias!$C$13","v":"4770002100"},{"$f":"\"Clientes Franq. D \"&Q4&\" \"&\"Tienda \"&Tabla3[[#This Row],[IdTienda]]","v":"Clientes Franq. D 91 Tienda 12"},{"$f":"\"Vtas. Franq. D \"&Q4&\" \"&\"Tienda \"&Tabla3[[#This Row],[IdTienda]]&\" Producto \"&Tabla3[[#This Row],[IdFamilia]]","v":"Vtas. Franq. D 91 Tienda 12 Producto 111"},{"$f":"\"IVA Rep. Venta Franq. D \"&Q4&\" \"&\"Tienda \"&Tabla3[[#This Row],[IdTienda]]","v":"IVA Rep. Venta Franq. D 91 Tienda 12"},{"$f":"\"Deudores Franq.D \"&Q4&\" Tienda \"&Tabla3[[#This Row],[IdTienda]]","v":"Deudores Franq.D 91 Tienda 12"},{"$f":"\"Ing. Royaltie Franq. D \"&Q4&\" \"&\"Tienda \"&Tabla3[[#This Row],[IdTienda]]","v":"Ing. Royaltie Franq. D 91 Tienda 12"},{"$f":"\"IVA Rep. Venta Franq. D \"&Q4&\" \"&\"Tienda \"&Tabla3[[#This Row],[IdTienda]]","v":"IVA Rep. Venta Franq. D 91 Tienda 12"},"E","R",{"$f":"AF3+1","v":3}]
[{"v":42058,"d":"4205800.00%"},13,112,444.11,1,null,{"$f":"ROUND(Tabla3[[#This Row],[Venta (IVA Inc.)]]/(1+I5),2)","v":427.03},{"$f":"ROUND(D5*VLOOKUP(Q5,Franquicias!$A$2:$E$7,5),2)","v":355.29},{"$f":"VLOOKUP(C5,Familias!$A$3:$C$8,3)","v":{"v":0.04,"d":"4.00%"}},341.63,13.66,{"$f":"VLOOKUP(Q5,Franquicias!$A$2:$H$7,4)","v":{"v":0.02,"d":"2.00%"}},8.54,{"$f":"Franquicias!$B$13","v":{"v":0.21,"d":"21%"}},10.33,1.79,{"$f":"VLOOKUP(B5,Tiendas!$A$2:$F$26,6)","v":94},{"$f":"VLOOKUP(Q5,Franquicias!$A$2:$H$7,6)","v":"4300000094"},{"$f":"VLOOKUP(Q5,Franquicias!$A$2:$H$7,7)","v":"4400000094"},"7000011213",{"$f":"VLOOKUP(C5,Familias!$A$3:$D$8,4)","v":"4770000400"},{"$f":"VLOOKUP(Q5,Franquicias!$A$2:$H$7,8)","v":"7050000094"},{"$f":"Franquicias!$C$13","v":"4770002100"},{"$f":"\"Clientes Franq. D \"&Q5&\" \"&\"Tienda \"&Tabla3[[#This Row],[IdTienda]]","v":"Clientes Franq. D 94 Tienda 13"},{"$f":"\"Vtas. Franq. D \"&Q5&\" \"&\"Tienda \"&Tabla3[[#This Row],[IdTienda]]&\" Producto \"&Tabla3[[#This Row],[IdFamilia]]","v":"Vtas. Franq. D 94 Tienda 13 Producto 112"},{"$f":"\"IVA Rep. Venta Franq. D \"&Q5&\" \"&\"Tienda \"&Tabla3[[#This Row],[IdTienda]]","v":"IVA Rep. Venta Franq. D 94 Tienda 13"},{"$f":"\"Deudores Franq.D \"&Q5&\" Tienda \"&Tabla3[[#This Row],[IdTienda]]","v":"Deudores Franq.D 94 Tienda 13"},{"$f":"\"Ing. Royaltie Franq. D \"&Q5&\" \"&\"Tienda \"&Tabla3[[#This Row],[IdTienda]]","v":"Ing. Royaltie Franq. D 94 Tienda 13"},{"$f":"\"IVA Rep. Venta Franq. D \"&Q5&\" \"&\"Tienda \"&Tabla3[[#This Row],[IdTienda]]","v":"IVA Rep. Venta Franq. D 94 Tienda 13"},"E","R",4]
[{"v":42058,"d":"4205800.00%"},12,111,256.87,1,null,{"$f":"ROUND(Tabla3[[#This Row],[Venta (IVA Inc.)]]/(1+I6),2)","v":233.52},{"$f":"ROUND(D6*VLOOKUP(Q6,Franquicias!$A$2:$E$7,5),2)","v":205.5},{"$f":"VLOOKUP(C6,Familias!$A$3:$C$8,3)","v":{"v":0.1,"d":"10.00%"}},186.82,18.68,{"$f":"VLOOKUP(Q6,Franquicias!$A$2:$H$7,4)","v":{"v":0.02,"d":"2.00%"}},4.67,{"$f":"Franquicias!$B$13","v":{"v":0.21,"d":"21%"}},5.65,0.98,{"$f":"VLOOKUP(B6,Tiendas!$A$2:$F$26,6)","v":91},{"$f":"VLOOKUP(Q6,Franquicias!$A$2:$H$7,6)","v":"4300000091"},{"$f":"VLOOKUP(Q6,Franquicias!$A$2:$H$7,7)","v":"4400000091"},"7000011112",{"$f":"VLOOKUP(C6,Familias!$A$3:$D$8,4)","v":"4770001000"},{"$f":"VLOOKUP(Q6,Franquicias!$A$2:$H$7,8)","v":"7050000091"},{"$f":"Franquicias!$C$13","v":"4770002100"},{"$f":"\"Clientes Franq. D \"&Q6&\" \"&\"Tienda \"&Tabla3[[#This Row],[IdTienda]]","v":"Clientes Franq. D 91 Tienda 12"},{"$f":"\"Vtas. Franq. D \"&Q6&\" \"&\"Tienda \"&Tabla3[[#This Row],[IdTienda]]&\" Producto \"&Tabla3[[#This Row],[IdFamilia]]","v":"Vtas. Franq. D 91 Tienda 12 Producto 111"},{"$f":"\"IVA Rep. Venta Franq. D \"&Q6&\" \"&\"Tienda \"&Tabla3[[#This Row],[IdTienda]]","v":"IVA Rep. Venta Franq. D 91 Tienda 12"},{"$f":"\"Deudores Franq.D \"&Q6&\" Tienda \"&Tabla3[[#This Row],[IdTienda]]","v":"Deudores Franq.D 91 Tienda 12"},{"$f":"\"Ing. Royaltie Franq. D \"&Q6&\" \"&\"Tienda \"&Tabla3[[#This Row],[IdTienda]]","v":"Ing. Royaltie Franq. D 91 Tienda 12"},{"$f":"\"IVA Rep. Venta Franq. D \"&Q6&\" \"&\"Tienda \"&Tabla3[[#This Row],[IdTienda]]","v":"IVA Rep. Venta Franq. D 91 Tienda 12"},"E","R",5]
[{"v":42058,"d":"4205800.00%"},14,121,221.52,2,2,{"$f":"ROUND(Tabla3[[#This Row],[Venta (IVA Inc.)]]/(1+I7),2)","v":183.07},{"$f":"ROUND(D7*VLOOKUP(Q7,Franquicias!$A$2:$E$7,5),2)","v":177.22},{"$f":"VLOOKUP(C7,Familias!$A$3:$C$8,3)","v":{"v":0.21,"d":"21.00%"}},146.46,30.76,{"$f":"VLOOKUP(Q7,Franquicias!$A$2:$H$7,4)","v":{"v":0.02,"d":"2.00%"}},3.66,{"$f":"Franquicias!$B$13","v":{"v":0.21,"d":"21%"}},4.43,0.77,{"$f":"VLOOKUP(B7,Tiendas!$A$2:$F$26,6)","v":91},{"$f":"VLOOKUP(Q7,Franquicias!$A$2:$H$7,6)","v":"4300000091"},{"$f":"VLOOKUP(Q7,Franquicias!$A$2:$H$7,7)","v":"4400000091"},"7000012114",{"$f":"VLOOKUP(C7,Familias!$A$3:$D$8,4)","v":"4770002100"},{"$f":"VLOOKUP(Q7,Franquicias!$A$2:$H$7,8)","v":"7050000091"},{"$f":"Franquicias!$C$13","v":"4770002100"},{"$f":"\"Clientes Franq. D \"&Q7&\" \"&\"Tienda \"&Tabla3[[#This Row],[IdTienda]]","v":"Clientes Franq. D 91 Tienda 14"},{"$f":"\"Vtas. Franq. D \"&Q7&\" \"&\"Tienda \"&Tabla3[[#This Row],[IdTienda]]&\" Producto \"&Tabla3[[#This Row],[IdFamilia]]","v":"Vtas. Franq. D 91 Tienda 14 Producto 121"},{"$f":"\"IVA Rep. Venta Franq. D \"&Q7&\" \"&\"Tienda \"&Tabla3[[#This Row],[IdTienda]]","v":"IVA Rep. Venta Franq. D 91 Tienda 14"},{"$f":"\"Deudores Franq.D \"&Q7&\" Tienda \"&Tabla3[[#This Row],[IdTienda]]","v":"Deudores Franq.D 91 Tienda 14"},{"$f":"\"Ing. Royaltie Franq. D \"&Q7&\" \"&\"Tienda \"&Tabla3[[#This Row],[IdTienda]]","v":"Ing. Royaltie Franq. D 91 Tienda 14"},{"$f":"\"IVA Rep. Venta Franq. D \"&Q7&\" \"&\"Tienda \"&Tabla3[[#This Row],[IdTienda]]","v":"IVA Rep. Venta Franq. D 91 Tienda 14"},"E","R",6]
[{"v":42058,"d":"4205800.00%"},13,112,365.11,1,null,{"$f":"ROUND(Tabla3[[#This Row],[Venta (IVA Inc.)]]/(1+I8),2)","v":351.07},{"$f":"ROUND(D8*VLOOKUP(Q8,Franquicias!$A$2:$E$7,5),2)","v":292.09},{"$f":"VLOOKUP(C8,Familias!$A$3:$C$8,3)","v":{"v":0.04,"d":"4.00%"}},280.86,11.23,{"$f":"VLOOKUP(Q8,Franquicias!$A$2:$H$7,4)","v":{"v":0.02,"d":"2.00%"}},7.02,{"$f":"Franquicias!$B$13","v":{"v":0.21,"d":"21%"}},8.49,1.47,{"$f":"VLOOKUP(B8,Tiendas!$A$2:$F$26,6)","v":94},{"$f":"VLOOKUP(Q8,Franquicias!$A$2:$H$7,6)","v":"4300000094"},{"$f":"VLOOKUP(Q8,Franquicias!$A$2:$H$7,7)","v":"4400000094"},"7000011213",{"$f":"VLOOKUP(C8,Familias!$A$3:$D$8,4)","v":"4770000400"},{"$f":"VLOOKUP(Q8,Franquicias!$A$2:$H$7,8)","v":"7050000094"},{"$f":"Franquicias!$C$13","v":"4770002100"},{"$f":"\"Clientes Franq. D \"&Q8&\" \"&\"Tienda \"&Tabla3[[#This Row],[IdTienda]]","v":"Clientes Franq. D 94 Tienda 13"},{"$f":"\"Vtas. Franq. D \"&Q8&\" \"&\"Tienda \"&Tabla3[[#This Row],[IdTienda]]&\" Producto \"&Tabla3[[#This Row],[IdFamilia]]","v":"Vtas. Franq. D 94 Tienda 13 Producto 112"},{"$f":"\"IVA Rep. Venta Franq. D \"&Q8&\" \"&\"Tienda \"&Tabla3[[#This Row],[IdTienda]]","v":"IVA Rep. Venta Franq. D 94 Tienda 13"},{"$f":"\"Deudores Franq.D \"&Q8&\" Tienda \"&Tabla3[[#This Row],[IdTienda]]","v":"Deudores Franq.D 94 Tienda 13"},{"$f":"\"Ing. Royaltie Franq. D \"&Q8&\" \"&\"Tienda \"&Tabla3[[#This Row],[IdTienda]]","v":"Ing. Royaltie Franq. D 94 Tienda 13"},{"$f":"\"IVA Rep. Venta Franq. D \"&Q8&\" \"&\"Tienda \"&Tabla3[[#This Row],[IdTienda]]","v":"IVA Rep. Venta Franq. D 94 Tienda 13"},"E","R",7]
[{"v":42058,"d":"4205800.00%"},13,122,445.11,1,null,{"$f":"ROUND(Tabla3[[#This Row],[Venta (IVA Inc.)]]/(1+I9),2)","v":367.86},{"$f":"ROUND(D9*VLOOKUP(Q9,Franquicias!$A$2:$E$7,5),2)","v":356.09},{"$f":"VLOOKUP(C9,Familias!$A$3:$C$8,3)","v":{"v":0.21,"d":"21.00%"}},294.29,61.8,{"$f":"VLOOKUP(Q9,Franquicias!$A$2:$H$7,4)","v":{"v":0.02,"d":"2.00%"}},7.36,{"$f":"Franquicias!$B$13","v":{"v":0.21,"d":"21%"}},8.91,1.55,{"$f":"VLOOKUP(B9,Tiendas!$A$2:$F$26,6)","v":94},{"$f":"VLOOKUP(Q9,Franquicias!$A$2:$H$7,6)","v":"4300000094"},{"$f":"VLOOKUP(Q9,Franquicias!$A$2:$H$7,7)","v":"4400000094"},"7000012213",{"$f":"VLOOKUP(C9,Familias!$A$3:$D$8,4)","v":"4770002100"},{"$f":"VLOOKUP(Q9,Franquicias!$A$2:$H$7,8)","v":"7050000094"},{"$f":"Franquicias!$C$13","v":"4770002100"},{"$f":"\"Clientes Franq. D \"&Q9&\" \"&\"Tienda \"&Tabla3[[#This Row],[IdTienda]]","v":"Clientes Franq. D 94 Tienda 13"},{"$f":"\"Vtas. Franq. D \"&Q9&\" \"&\"Tienda \"&Tabla3[[#This Row],[IdTienda]]&\" Producto \"&Tabla3[[#This Row],[IdFamilia]]","v":"Vtas. Franq. D 94 Tienda 13 Producto 122"},{"$f":"\"IVA Rep. Venta Franq. D \"&Q9&\" \"&\"Tienda \"&Tabla3[[#This Row],[IdTienda]]","v":"IVA Rep. Venta Franq. D 94 Tienda 13"},{"$f":"\"Deudores Franq.D \"&Q9&\" Tienda \"&Tabla3[[#This Row],[IdTienda]]","v":"Deudores Franq.D 94 Tienda 13"},{"$f":"\"Ing. Royaltie Franq. D \"&Q9&\" \"&\"Tienda \"&Tabla3[[#This Row],[IdTienda]]","v":"Ing. Royaltie Franq. D 94 Tienda 13"},{"$f":"\"IVA Rep. Venta Franq. D \"&Q9&\" \"&\"Tienda \"&Tabla3[[#This Row],[IdTienda]]","v":"IVA Rep. Venta Franq. D 94 Tienda 13"},"E","R",8]
[{"v":42058,"d":"4205800.00%"},12,123,203.6,1,null,{"$f":"ROUND(Tabla3[[#This Row],[Venta (IVA Inc.)]]/(1+I10),2)","v":168.26},{"$f":"ROUND(D10*VLOOKUP(Q10,Franquicias!$A$2:$E$7,5),2)","v":162.88},{"$f":"VLOOKUP(C10,Familias!$A$3:$C$8,3)","v":{"v":0.21,"d":"21.00%"}},134.61,28.27,{"$f":"VLOOKUP(Q10,Franquicias!$A$2:$H$7,4)","v":{"v":0.02,"d":"2.00%"}},3.37,{"$f":"Franquicias!$B$13","v":{"v":0.21,"d":"21%"}},4.08,0.71,{"$f":"VLOOKUP(B10,Tiendas!$A$2:$F$26,6)","v":91},{"$f":"VLOOKUP(Q10,Franquicias!$A$2:$H$7,6)","v":"4300000091"},{"$f":"VLOOKUP(Q10,Franquicias!$A$2:$H$7,7)","v":"4400000091"},"7000012312",{"$f":"VLOOKUP(C10,Familias!$A$3:$D$8,4)","v":"4770002100"},{"$f":"VLOOKUP(Q10,Franquicias!$A$2:$H$7,8)","v":"7050000091"},{"$f":"Franquicias!$C$13","v":"4770002100"},{"$f":"\"Clientes Franq. D \"&Q10&\" \"&\"Tienda \"&Tabla3[[#This Row],[IdTienda]]","v":"Clientes Franq. D 91 Tienda 12"},{"$f":"\"Vtas. Franq. D \"&Q10&\" \"&\"Tienda \"&Tabla3[[#This Row],[IdTienda]]&\" Producto \"&Tabla3[[#This Row],[IdFamilia]]","v":"Vtas. Franq. D 91 Tienda 12 Producto 123"},{"$f":"\"IVA Rep. Venta Franq. D \"&Q10&\" \"&\"Tienda \"&Tabla3[[#This Row],[IdTienda]]","v":"IVA Rep. Venta Franq. D 91 Tienda 12"},{"$f":"\"Deudores Franq.D \"&Q10&\" Tienda \"&Tabla3[[#This Row],[IdTienda]]","v":"Deudores Franq.D 91 Tienda 12"},{"$f":"\"Ing. Royaltie Franq. D \"&Q10&\" \"&\"Tienda \"&Tabla3[[#This Row],[IdTienda]]","v":"Ing. Royaltie Franq. D 91 Tienda 12"},{"$f":"\"IVA Rep. Venta Franq. D \"&Q10&\" \"&\"Tienda \"&Tabla3[[#This Row],[IdTienda]]","v":"IVA Rep. Venta Franq. D 91 Tienda 12"},"E","R",9]
[{"v":42058,"d":"4205800.00%"},12,111,93.05,2,2,{"$f":"ROUND(Tabla3[[#This Row],[Venta (IVA Inc.)]]/(1+I11),2)","v":84.59},{"$f":"ROUND(D11*VLOOKUP(Q11,Franquicias!$A$2:$E$7,5),2)","v":74.44},{"$f":"VLOOKUP(C11,Familias!$A$3:$C$8,3)","v":{"v":0.1,"d":"10.00%"}},67.67,6.77,{"$f":"VLOOKUP(Q11,Franquicias!$A$2:$H$7,4)","v":{"v":0.02,"d":"2.00%"}},1.69,{"$f":"Franquicias!$B$13","v":{"v":0.21,"d":"21%"}},2.04,0.35,{"$f":"VLOOKUP(B11,Tiendas!$A$2:$F$26,6)","v":91},{"$f":"VLOOKUP(Q11,Franquicias!$A$2:$H$7,6)","v":"4300000091"},{"$f":"VLOOKUP(Q11,Franquicias!$A$2:$H$7,7)","v":"4400000091"},"7000011112",{"$f":"VLOOKUP(C11,Familias!$A$3:$D$8,4)","v":"4770001000"},{"$f":"VLOOKUP(Q11,Franquicias!$A$2:$H$7,8)","v":"7050000091"},{"$f":"Franquicias!$C$13","v":"4770002100"},{"$f":"\"Clientes Franq. D \"&Q11&\" \"&\"Tienda \"&Tabla3[[#This Row],[IdTienda]]","v":"Clientes Franq. D 91 Tienda 12"},{"$f":"\"Vtas. Franq. D \"&Q11&\" \"&\"Tienda \"&Tabla3[[#This Row],[IdTienda]]&\" Producto \"&Tabla3[[#This Row],[IdFamilia]]","v":"Vtas. Franq. D 91 Tienda 12 Producto 111"},{"$f":"\"IVA Rep. Venta Franq. D \"&Q11&\" \"&\"Tienda \"&Tabla3[[#This Row],[IdTienda]]","v":"IVA Rep. Venta Franq. D 91 Tienda 12"},{"$f":"\"Deudores Franq.D \"&Q11&\" Tienda \"&Tabla3[[#This Row],[IdTienda]]","v":"Deudores Franq.D 91 Tienda 12"},{"$f":"\"Ing. Royaltie Franq. D \"&Q11&\" \"&\"Tienda \"&Tabla3[[#This Row],[IdTienda]]","v":"Ing. Royaltie Franq. D 91 Tienda 12"},{"$f":"\"IVA Rep. Venta Franq. D \"&Q11&\" \"&\"Tienda \"&Tabla3[[#This Row],[IdTienda]]","v":"IVA Rep. Venta Franq. D 91 Tienda 12"},"E","R",10]
[{"v":42058,"d":"4205800.00%"},14,113,227.27,2,1,{"$f":"ROUND(Tabla3[[#This Row],[Venta (IVA Inc.)]]/(1+I12),2)","v":187.83},{"$f":"ROUND(D12*VLOOKUP(Q12,Franquicias!$A$2:$E$7,5),2)","v":181.82},{"$f":"VLOOKUP(C12,Familias!$A$3:$C$8,3)","v":{"v":0.21,"d":"21.00%"}},150.26,31.56,{"$f":"VLOOKUP(Q12,Franquicias!$A$2:$H$7,4)","v":{"v":0.02,"d":"2.00%"}},3.76,{"$f":"Franquicias!$B$13","v":{"v":0.21,"d":"21%"}},4.55,0.79,{"$f":"VLOOKUP(B12,Tiendas!$A$2:$F$26,6)","v":91},{"$f":"VLOOKUP(Q12,Franquicias!$A$2:$H$7,6)","v":"4300000091"},{"$f":"VLOOKUP(Q12,Franquicias!$A$2:$H$7,7)","v":"4400000091"},"7000011314",{"$f":"VLOOKUP(C12,Familias!$A$3:$D$8,4)","v":"4770002100"},{"$f":"VLOOKUP(Q12,Franquicias!$A$2:$H$7,8)","v":"7050000091"},{"$f":"Franquicias!$C$13","v":"4770002100"},{"$f":"\"Clientes Franq. D \"&Q12&\" \"&\"Tienda \"&Tabla3[[#This Row],[IdTienda]]","v":"Clientes Franq. D 91 Tienda 14"},{"$f":"\"Vtas. Franq. D \"&Q12&\" \"&\"Tienda \"&Tabla3[[#This Row],[IdTienda]]&\" Producto \"&Tabla3[[#This Row],[IdFamilia]]","v":"Vtas. Franq. D 91 Tienda 14 Producto 113"},{"$f":"\"IVA Rep. Venta Franq. D \"&Q12&\" \"&\"Tienda \"&Tabla3[[#This Row],[IdTienda]]","v":"IVA Rep. Venta Franq. D 91 Tienda 14"},{"$f":"\"Deudores Franq.D \"&Q12&\" Tienda \"&Tabla3[[#This Row],[IdTienda]]","v":"Deudores Franq.D 91 Tienda 14"},{"$f":"\"Ing. Royaltie Franq. D \"&Q12&\" \"&\"Tienda \"&Tabla3[[#This Row],[IdTienda]]","v":"Ing. Royaltie Franq. D 91 Tienda 14"},{"$f":"\"IVA Rep. Venta Franq. D \"&Q12&\" \"&\"Tienda \"&Tabla3[[#This Row],[IdTienda]]","v":"IVA Rep. Venta Franq. D 91 Tienda 14"},"E","R",11]
[{"v":42058,"d":"4205800.00%"},13,113,369.25,1,null,{"$f":"ROUND(Tabla3[[#This Row],[Venta (IVA Inc.)]]/(1+I13),2)","v":305.17},{"$f":"ROUND(D13*VLOOKUP(Q13,Franquicias!$A$2:$E$7,5),2)","v":295.4},{"$f":"VLOOKUP(C13,Familias!$A$3:$C$8,3)","v":{"v":0.21,"d":"21.00%"}},244.13,51.27,{"$f":"VLOOKUP(Q13,Franquicias!$A$2:$H$7,4)","v":{"v":0.02,"d":"2.00%"}},6.1,{"$f":"Franquicias!$B$13","v":{"v":0.21,"d":"21%"}},7.38,1.28,{"$f":"VLOOKUP(B13,Tiendas!$A$2:$F$26,6)","v":94},{"$f":"VLOOKUP(Q13,Franquicias!$A$2:$H$7,6)","v":"4300000094"},{"$f":"VLOOKUP(Q13,Franquicias!$A$2:$H$7,7)","v":"4400000094"},"7000011313",{"$f":"VLOOKUP(C13,Familias!$A$3:$D$8,4)","v":"4770002100"},{"$f":"VLOOKUP(Q13,Franquicias!$A$2:$H$7,8)","v":"7050000094"},{"$f":"Franquicias!$C$13","v":"4770002100"},{"$f":"\"Clientes Franq. D \"&Q13&\" \"&\"Tienda \"&Tabla3[[#This Row],[IdTienda]]","v":"Clientes Franq. D 94 Tienda 13"},{"$f":"\"Vtas. Franq. D \"&Q13&\" \"&\"Tienda \"&Tabla3[[#This Row],[IdTienda]]&\" Producto \"&Tabla3[[#This Row],[IdFamilia]]","v":"Vtas. Franq. D 94 Tienda 13 Producto 113"},{"$f":"\"IVA Rep. Venta Franq. D \"&Q13&\" \"&\"Tienda \"&Tabla3[[#This Row],[IdTienda]]","v":"IVA Rep. Venta Franq. D 94 Tienda 13"},{"$f":"\"Deudores Franq.D \"&Q13&\" Tienda \"&Tabla3[[#This Row],[IdTienda]]","v":"Deudores Franq.D 94 Tienda 13"},{"$f":"\"Ing. Royaltie Franq. D \"&Q13&\" \"&\"Tienda \"&Tabla3[[#This Row],[IdTienda]]","v":"Ing. Royaltie Franq. D 94 Tienda 13"},{"$f":"\"IVA Rep. Venta Franq. D \"&Q13&\" \"&\"Tienda \"&Tabla3[[#This Row],[IdTienda]]","v":"IVA Rep. Venta Franq. D 94 Tienda 13"},"E","R",12]

{"sheet":"AstosVentasTPVFranqDepósito","index":17,"n_rows":73,"n_cols":17,"rows_kept":73}
["Diario","Fecha","Asiento","Orden","Cuenta","Importe Pts","Concepto","Documento","Debe","Haber","Moneda","Punteo","TipoIVA","Nº IVA","Depto.","Subdepto.","Imagen"]
[1,{"v":42058,"d":"4205800.00%"},1,1,4300000091,null,"Clientes Franq. D 91 Tienda 12",null,505.78,null,"E",null,"R",1]
[1,{"v":42058,"d":"4205800.00%"},1,2,7000012212,null,"Vtas. Franq. D 91 Tienda 12 Producto 122",null,null,418,"E",null,"R",1]
[1,{"v":42058,"d":"4205800.00%"},1,3,4770002100,null,"IVA Rep. Venta Franq. D 91 Tienda 12",null,null,87.78,"E",null,"R",1]
[1,{"v":42058,"d":"4205800.00%"},2,1,4400000091,null,"Deudores Franq.D 91 Tienda 12",null,12.64,null,"E",null,"R",1]
[1,{"v":42058,"d":"4205800.00%"},2,2,7050000091,null,"Ing. Royaltie Franq. D 91 Tienda 12",null,null,10.45,"E",null,"R",1]
[1,{"v":42058,"d":"4205800.00%"},2,3,4770002100,null,"IVA Rep. Venta Franq. D 91 Tienda 12",null,null,2.19,"E",null,"R",1]
[1,{"v":42058,"d":"4205800.00%"},3,1,4300000091,null,"Clientes Franq. D 91 Tienda 14",null,116.21,null,"E",null,"R",2]
[1,{"v":42058,"d":"4205800.00%"},3,2,7000012314,null,"Vtas. Franq. D 91 Tienda 14 Producto 123",null,null,96.04,"E",null,"R",2]
[1,{"v":42058,"d":"4205800.00%"},3,3,4770002100,null,"IVA Rep. Venta Franq. D 91 Tienda 14",null,null,20.17,"E",null,"R",2]
[1,{"v":42058,"d":"4205800.00%"},4,1,4400000091,null,"Deudores Franq.D 91 Tienda 14",null,2.9,null,"E",null,"R",2]
[1,{"v":42058,"d":"4205800.00%"},4,2,7050000091,null,"Ing. Royaltie Franq. D 91 Tienda 14",null,null,2.4,"E",null,"R",2]
[1,{"v":42058,"d":"4205800.00%"},4,3,4770002100,null,"IVA Rep. Venta Franq. D 91 Tienda 14",null,null,0.5,"E",null,"R",2]
[1,{"v":42058,"d":"4205800.00%"},5,1,4300000091,null,"Clientes Franq. D 91 Tienda 12",null,266.58,null,"E",null,"R",3]
[1,{"v":42058,"d":"4205800.00%"},5,2,7000011112,null,"Vtas. Franq. D 91 Tienda 12 Producto 111",null,null,242.35,"E",null,"R",3]
[1,{"v":42058,"d":"4205800.00%"},5,3,4770001000,null,"IVA Rep. Venta Franq. D 91 Tienda 12",null,null,24.23,"E",null,"R",3]
[1,{"v":42058,"d":"4205800.00%"},6,1,4400000091,null,"Deudores Franq.D 91 Tienda 12",null,7.33,null,"E",null,"R",3]
[1,{"v":42058,"d":"4205800.00%"},6,2,7050000091,null,"Ing. Royaltie Franq. D 91 Tienda 12",null,null,6.06,"E",null,"R",3]
[1,{"v":42058,"d":"4205800.00%"},6,3,4770002100,null,"IVA Rep. Venta Franq. D 91 Tienda 12",null,null,1.27,"E",null,"R",3]
[1,{"v":42058,"d":"4205800.00%"},7,1,4300000094,null,"Clientes Franq. D 94 Tienda 13",null,355.29,null,"E",null,"R",4]
[1,{"v":42058,"d":"4205800.00%"},7,2,7000011213,null,"Vtas. Franq. D 94 Tienda 13 Producto 112",null,null,341.63,"E",null,"R",4]
[1,{"v":42058,"d":"4205800.00%"},7,3,4770000400,null,"IVA Rep. Venta Franq. D 94 Tienda 13",null,null,13.66,"E",null,"R",4]
[1,{"v":42058,"d":"4205800.00%"},8,1,4400000094,null,"Deudores Franq.D 94 Tienda 13",null,10.33,null,"E",null,"R",4]
[1,{"v":42058,"d":"4205800.00%"},8,2,7050000094,null,"Ing. Royaltie Franq. D 94 Tienda 13",null,null,8.54,"E",null,"R",4]
[1,{"v":42058,"d":"4205800.00%"},8,3,4770002100,null,"IVA Rep. Venta Franq. D 94 Tienda 13",null,null,1.79,"E",null,"R",4]
[1,{"v":42058,"d":"4205800.00%"},9,1,4300000091,null,"Clientes Franq. D 91 Tienda 12",null,205.5,null,"E",null,"R",5]
[1,{"v":42058,"d":"4205800.00%"},9,2,7000011112,null,"Vtas. Franq. D 91 Tienda 12 Producto 111",null,null,186.82,"E",null,"R",5]
[1,{"v":42058,"d":"4205800.00%"},9,3,4770001000,null,"IVA Rep. Venta Franq. D 91 Tienda 12",null,null,18.68,"E",null,"R",5]
[1,{"v":42058,"d":"4205800.00%"},10,1,4400000091,null,"Deudores Franq.D 91 Tienda 12",null,5.65,null,"E",null,"R",5]
[1,{"v":42058,"d":"4205800.00%"},10,2,7050000091,null,"Ing. Royaltie Franq. D 91 Tienda 12",null,null,4.67,"E",null,"R",5]
[1,{"v":42058,"d":"4205800.00%"},10,3,4770002100,null,"IVA Rep. Venta Franq. D 91 Tienda 12",null,null,0.98,"E",null,"R",5]
[1,{"v":42058,"d":"4205800.00%"},11,1,4300000091,null,"Clientes Franq. D 91 Tienda 14",null,177.22,null,"E",null,"R",6]
[1,{"v":42058,"d":"4205800.00%"},11,2,7000012114,null,"Vtas. Franq. D 91 Tienda 14 Producto 121",null,null,146.46,"E",null,"R",6]
[1,{"v":42058,"d":"4205800.00%"},11,3,4770002100,null,"IVA Rep. Venta Franq. D 91 Tienda 14",null,null,30.76,"E",null,"R",6]
[1,{"v":42058,"d":"4205800.00%"},12,1,4400000091,null,"Deudores Franq.D 91 Tienda 14",null,4.43,null,"E",null,"R",6]
[1,{"v":42058,"d":"4205800.00%"},12,2,7050000091,null,"Ing. Royaltie Franq. D 91 Tienda 14",null,null,3.66,"E",null,"R",6]
[1,{"v":42058,"d":"4205800.00%"},12,3,4770002100,null,"IVA Rep. Venta Franq. D 91 Tienda 14",null,null,0.77,"E",null,"R",6]
[1,{"v":42058,"d":"4205800.00%"},13,1,4300000094,null,"Clientes Franq. D 94 Tienda 13",null,292.09,null,"E",null,"R",7]
[1,{"v":42058,"d":"4205800.00%"},13,2,7000011213,null,"Vtas. Franq. D 94 Tienda 13 Producto 112",null,null,280.86,"E",null,"R",7]
[1,{"v":42058,"d":"4205800.00%"},13,3,4770000400,null,"IVA Rep. Venta Franq. D 94 Tienda 13",null,null,11.23,"E",null,"R",7]
[1,{"v":42058,"d":"4205800.00%"},14,1,4400000094,null,"Deudores Franq.D 94 Tienda 13",null,8.49,null,"E",null,"R",7]
[1,{"v":42058,"d":"4205800.00%"},14,2,7050000094,null,"Ing. Royaltie Franq. D 94 Tienda 13",null,null,7.02,"E",null,"R",7]
[1,{"v":42058,"d":"4205800.00%"},14,3,4770002100,null,"IVA Rep. Venta Franq. D 94 Tienda 13",null,null,1.47,"E",null,"R",7]
[1,{"v":42058,"d":"4205800.00%"},15,1,4300000094,null,"Clientes Franq. D 94 Tienda 13",null,356.09,null,"E",null,"R",8]
[1,{"v":42058,"d":"4205800.00%"},15,2,7000012213,null,"Vtas. Franq. D 94 Tienda 13 Producto 122",null,null,294.29,"E",null,"R",8]
[1,{"v":42058,"d":"4205800.00%"},15,3,4770002100,null,"IVA Rep. Venta Franq. D 94 Tienda 13",null,null,61.8,"E",null,"R",8]
[1,{"v":42058,"d":"4205800.00%"},16,1,4400000094,null,"Deudores Franq.D 94 Tienda 13",null,8.91,null,"E",null,"R",8]
[1,{"v":42058,"d":"4205800.00%"},16,2,7050000094,null,"Ing. Royaltie Franq. D 94 Tienda 13",null,null,7.36,"E",null,"R",8]
[1,{"v":42058,"d":"4205800.00%"},16,3,4770002100,null,"IVA Rep. Venta Franq. D 94 Tienda 13",null,null,1.55,"E",null,"R",8]
[1,{"v":42058,"d":"4205800.00%"},17,1,4300000091,null,"Clientes Franq. D 91 Tienda 12",null,162.88,null,"E",null,"R",9]
[1,{"v":42058,"d":"4205800.00%"},17,2,7000012312,null,"Vtas. Franq. D 91 Tienda 12 Producto 123",null,null,134.61,"E",null,"R",9]
[1,{"v":42058,"d":"4205800.00%"},17,3,4770002100,null,"IVA Rep. Venta Franq. D 91 Tienda 12",null,null,28.27,"E",null,"R",9]
[1,{"v":42058,"d":"4205800.00%"},18,1,4400000091,null,"Deudores Franq.D 91 Tienda 12",null,4.08,null,"E",null,"R",9]
[1,{"v":42058,"d":"4205800.00%"},18,2,7050000091,null,"Ing. Royaltie Franq. D 91 Tienda 12",null,null,3.37,"E",null,"R",9]
[1,{"v":42058,"d":"4205800.00%"},18,3,4770002100,null,"IVA Rep. Venta Franq. D 91 Tienda 12",null,null,0.71,"E",null,"R",9]
[1,{"v":42058,"d":"4205800.00%"},19,1,4300000091,null,"Clientes Franq. D 91 Tienda 12",null,74.44,null,"E",null,"R",10]
[1,{"v":42058,"d":"4205800.00%"},19,2,7000011112,null,"Vtas. Franq. D 91 Tienda 12 Producto 111",null,null,67.67,"E",null,"R",10]
[1,{"v":42058,"d":"4205800.00%"},19,3,4770001000,null,"IVA Rep. Venta Franq. D 91 Tienda 12",null,null,6.77,"E",null,"R",10]
[1,{"v":42058,"d":"4205800.00%"},20,1,4400000091,null,"Deudores Franq.D 91 Tienda 12",null,2.04,null,"E",null,"R",10]
[1,{"v":42058,"d":"4205800.00%"},20,2,7050000091,null,"Ing. Royaltie Franq. D 91 Tienda 12",null,null,1.69,"E",null,"R",10]
[1,{"v":42058,"d":"4205800.00%"},20,3,4770002100,null,"IVA Rep. Venta Franq. D 91 Tienda 12",null,null,0.35,"E",null,"R",10]
[1,{"v":42058,"d":"4205800.00%"},21,1,4300000091,null,"Clientes Franq. D 91 Tienda 14",null,181.82,null,"E",null,"R",11]
[1,{"v":42058,"d":"4205800.00%"},21,2,7000011314,null,"Vtas. Franq. D 91 Tienda 14 Producto 113",null,null,150.26,"E",null,"R",11]
[1,{"v":42058,"d":"4205800.00%"},21,3,4770002100,null,"IVA Rep. Venta Franq. D 91 Tienda 14",null,null,31.56,"E",null,"R",11]
[1,{"v":42058,"d":"4205800.00%"},22,1,4400000091,null,"Deudores Franq.D 91 Tienda 14",null,4.55,null,"E",null,"R",11]
[1,{"v":42058,"d":"4205800.00%"},22,2,7050000091,null,"Ing. Royaltie Franq. D 91 Tienda 14",null,null,3.76,"E",null,"R",11]
[1,{"v":42058,"d":"4205800.00%"},22,3,4770002100,null,"IVA Rep. Venta Franq. D 91 Tienda 14",null,null,0.79,"E",null,"R",11]
[1,{"v":42058,"d":"4205800.00%"},23,1,4300000094,null,"Clientes Franq. D 94 Tienda 13",null,295.4,null,"E",null,"R",12]
[1,{"v":42058,"d":"4205800.00%"},23,2,7000011313,null,"Vtas. Franq. D 94 Tienda 13 Producto 113",null,null,244.13,"E",null,"R",12]
[1,{"v":42058,"d":"4205800.00%"},23,3,4770002100,null,"IVA Rep. Venta Franq. D 94 Tienda 13",null,null,51.27,"E",null,"R",12]
[1,{"v":42058,"d":"4205800.00%"},24,1,4400000094,null,"Deudores Franq.D 94 Tienda 13",null,7.38,null,"E",null,"R",12]
[1,{"v":42058,"d":"4205800.00%"},24,2,7050000094,null,"Ing. Royaltie Franq. D 94 Tienda 13",null,null,6.1,"E",null,"R",12]
[1,{"v":42058,"d":"4205800.00%"},24,3,4770002100,null,"IVA Rep. Venta Franq. D 94 Tienda 13",null,null,1.28,"E",null,"R",12]

{"sheet":"ConfigVentasTPVPropias","index":18,"n_rows":24,"n_cols":17,"rows_kept":24,"merged":[[0,3,0,5],[1,3,1,5]]}
["Hoja con los datos de entrada:",null,null,"VentasTPVPropias"]
["Datos de salida:",null,null,"AstosVentasPropias"]
["Primer número de asiento:",null,null,1]
["Procedimientos a ejecutar previamente:",{"$nulls":3},"Macro7","Macro8"]
[]
[]
[]
[]
["Diario","Fecha","Asiento","Orden","Cuenta","Importe Pts","Concepto","Documento","Debe","Haber","Moneda","Punteo","TipoIVA","Nº IVA","Depto.","Subdepto.","Imagen"]
[1,"A","#1",1,"R",null,"AF",null,"Y",null,"AD",null,"AB","AC"]
[1,"A","#1",2,"W",null,"AG",null,"X",null,"AD",null,"AB","AC"]
[1,"A","#1",3,"P",null,"AL",null,null,"J","AD",null,"AB","AC"]
[1,"A","#1",4,"L",null,"AH",null,null,"N","AD",null,"AB","AC"]
[1,"A","#2",1,"T",null,"AI",null,"U",null,"AD",1,"AB","AC"]
[1,"A","#2",2,"Q",null,"AA",null,null,"H","AD",null,"AB","AC"]
[1,"A","#2",3,"M",null,"AJ",null,null,"O","AD",null,"AB","AC"]
[1,"AE","#3",1,"S",null,"AK",null,"Z",null,"AD",null,"AB","AC"]
[1,"AE","#3",2,"T",null,"AI",null,null,"U","AD",1,"AB","AC"]
[]
[]
[]
[]
[]
[{"$nulls":7}," "]

{"sheet":"VentasTPVPropias","index":19,"n_rows":18,"n_cols":38,"rows_kept":18}
["Fecha","IdTienda","IdFamilia","Ventas (IVA inc)","F. Pago","Id Tarjeta","Venta Efectivo","Venta Efec. Sin IVA","Venta Tarjeta","Venta Tarj. Sin IVA","% IVA","Cta. IVA Tarj","Cta. IVA Efect","Imp. IVA Tarj","Imp. IVA Efec","Cta. Ventas Tarj","Cta. Ventas Efec","Cta. Banco tarjeta","Cta.Banco Efectivo","Cta. Caja","Imp. Caja","%Comisión","Cta. Comisión","Imp. Comisión","Imp. Banco Tarj.","Imp.Banco Efec.","Concepto Venta Efectivo","Tipo IVA","nº IVA","Moneda","Fecha aplazamiento","Conc. Bancos Tarj.","Conc. Comisión","Conc. IVA Tarjeta","Conp. Caja","Conc. IVA Efec","Conc. Banco Efec","Conc. Venta Tarjeta"]
[{"v":42058,"d":"4205800.00%"},11,113,98.36,1,null,{"$f":"IF(E2=1,D2,\"\")","v":98.36},{"$f":"IF(E2=1,ROUND(G2/(1+K2),2),\"\")","v":81.29},{"$f":"IF(E2=2,D2,\"\")","v":""},{"$f":"IF(E2=2,ROUND(D2/(1+K2),2),\"\")","v":""},{"$f":"VLOOKUP(C2,Familias!$A$3:$D$8,3)","v":{"v":0.21,"d":"21.00%"}},{"$f":"IF(E2=2,VLOOKUP(C2,Familias!$A$3:$D$8,4),\"\")","v":""},{"$f":"IF(E2=1,VLOOKUP(C2,Familias!$A$3:$D$8,4),\"\")","v":"4770002100"},{"$f":"IF(E2=2,ROUND(I2-J2,2),\"\")","v":""},{"$f":"IF(E2=1,ROUND(G2-H2,2),\"\")","v":17.07},{"$f":"IF(E2=2,\"70000\"&C2&B2,\"\")","v":""},{"$f":"IF(E2=1,\"70000\"&C2&B2,\"\")","v":"7000011311"},{"$f":"IF(E2=2,VLOOKUP(B2,Tiendas!$A$3:$K$28,11),\"\")","v":""},{"$f":"IF(E2=1,VLOOKUP(B2,Tabla6[[Id Tienda]:[Cta. Banco Efectivo]],10),\"\")","v":"5720010003"},{"$f":"IF(E2=1,VLOOKUP(B2,Tabla6[[Id Tienda]:[Cta. Caja]],7),\"\")","v":"5700000011"},{"$f":"IF(E2=1,H2+O2,\"\")","v":98.36000000000001},{"$f":"IF(E2=2,VLOOKUP(F2,Tarjetas!$A$2:$D$5,3),\"\")","v":""},{"$f":"IF(V2=\"\",\"\",VLOOKUP(F2,Tarjetas!$A$2:$D$5,4))","v":""},{"$f":"IF(E2=2,ROUND(I2*V2,2),\"\")","v":""},{"$f":"IF(E2=2,ROUND((J2+N2)-X2,2),\"\")","v":""},{"$f":"IF(E2=1,H2+O2,\"\")","v":98.36000000000001},{"$f":"IF(E2=1,\"Venta Efec. \"&\"Tienda \"&B2&\" Producto \"&C2,\"\")","v":"Venta Efec. Tienda 11 Producto 113"},"R",1,"E",{"$f":"IF(E2=1,A2+VLOOKUP(B2,Tabla6[],12),\"\")","v":{"v":42061,"d":"4206100.00%"}},{"$f":"IF(E2=2,\"Bancos Tarj. \"&Tabla5[[#This Row],[Id Tarjeta]]&\" Tienda \"&B2,\"\")","v":""},{"$f":"IF(E2=2,\"Comisión Tarj.\"&Tabla5[[#This Row],[Id Tarjeta]]&\" Tienda \"&B2,\"\")","v":""},{"$f":"IF(E2=2,\"IVA Rep. Tienda \"&B2,\"\")","v":""},{"$f":"IF(E2=1,\"Caja Tienda \"&B2,\"\")","v":"Caja Tienda 11"},{"$f":"IF(E2=1,\"IVA Rep. Tienda \"&B2,\"\")","v":"IVA Rep. Tienda 11"},{"$f":"IF(E2=1,\"Bancos Efec. Tienda \"&B2,\"\")","v":"Bancos Efec. Tienda 11"},{"$f":"IF(E2=2,\"Venta Tarj. \"&Tabla5[[#This Row],[Id Tarjeta]]&\" Tienda \"&B2&\" Producto \"&C2,\"\")","v":""}]
[{"v":42058,"d":"4205800.00%"},32,121,115.28,2,2,{"$f":"IF(E3=1,D3,\"\")","v":""},{"$f":"IF(E3=1,ROUND(G3/(1+K3),2),\"\")","v":""},{"$f":"IF(E3=2,D3,\"\")","v":115.28},{"$f":"IF(E3=2,ROUND(D3/(1+K3),2),\"\")","v":95.27},{"$f":"VLOOKUP(C3,Familias!$A$3:$D$8,3)","v":{"v":0.21,"d":"21.00%"}},{"$f":"IF(E3=2,VLOOKUP(C3,Familias!$A$3:$D$8,4),\"\")","v":"4770002100"},{"$f":"IF(E3=1,VLOOKUP(C3,Familias!$A$3:$D$8,4),\"\")","v":""},{"$f":"IF(E3=2,ROUND(I3-J3,2),\"\")","v":20.01},{"$f":"IF(E3=1,ROUND(G3-H3,2),\"\")","v":""},{"$f":"IF(E3=2,\"70000\"&C3&B3,\"\")","v":"7000012132"},{"$f":"IF(E3=1,\"70000\"&C3&B3,\"\")","v":""},{"$f":"IF(E3=2,VLOOKUP(B3,Tiendas!$A$3:$K$28,11),\"\")","v":"5720020001"},{"$f":"IF(E3=1,VLOOKUP(B3,Tabla6[[Id Tienda]:[Cta. Banco Efectivo]],10),\"\")","v":""},{"$f":"IF(E3=1,VLOOKUP(B3,Tabla6[[Id Tienda]:[Cta. Caja]],7),\"\")","v":""},{"$f":"IF(E3=1,H3+O3,\"\")","v":""},{"$f":"IF(E3=2,VLOOKUP(F3,Tarjetas!$A$2:$D$5,3),\"\")","v":{"v":0.0125,"d":"1.25%"}},{"$f":"IF(V3=\"\",\"\",VLOOKUP(F3,Tarjetas!$A$2:$D$5,4))","v":"6690000002"},{"$f":"IF(E3=2,ROUND(I3*V3,2),\"\")","v":1.44},{"$f":"IF(E3=2,ROUND((J3+N3)-X3,2),\"\")","v":113.84},{"$f":"IF(E3=1,H3+O3,\"\")","v":""},{"$f":"IF(E3=1,\"Venta Efec. \"&\"Tienda \"&B3&\" Producto \"&C3,\"\")","v":""},"R",{"$f":"AC2+1","v":2},"E",{"$f":"IF(E3=1,A3+VLOOKUP(B3,Tabla6[],12),\"\")","v":""},{"$f":"IF(E3=2,\"Bancos Tarj. \"&Tabla5[[#This Row],[Id Tarjeta]]&\" Tienda \"&B3,\"\")","v":"Bancos Tarj. 2 Tienda 32"},{"$f":"IF(E3=2,\"Comisión Tarj.\"&Tabla5[[#This Row],[Id Tarjeta]]&\" Tienda \"&B3,\"\")","v":"Comisión Tarj.2 Tienda 32"},{"$f":"IF(E3=2,\"IVA Rep. Tienda \"&B3,\"\")","v":"IVA Rep. Tienda 32"},{"$f":"IF(E3=1,\"Caja Tienda \"&B3,\"\")","v":""},{"$f":"IF(E3=1,\"IVA Rep. Tienda \"&B3,\"\")","v":""},{"$f":"IF(E3=1,\"Bancos Efec. Tienda \"&B3,\"\")","v":""},{"$f":"IF(E3=2,\"Venta Tarj. \"&Tabla5[[#This Row],[Id Tarjeta]]&\" Tienda \"&B3&\" Producto \"&C3,\"\")","v":"Venta Tarj. 2 Tienda 32 Producto 121"}]
[{"v":42058,"d":"4205800.00%"},42,122,263.98,1,null,263.98,218.17,"","",{"$f":"VLOOKUP(C4,Familias!$A$3:$D$8,3)","v":{"v":0.21,"d":"21.00%"}},{"$f":"IF(E4=2,VLOOKUP(C4,Familias!$A$3:$D$8,4),\"\")","v":""},{"$f":"IF(E4=1,VLOOKUP(C4,Familias!$A$3:$D$8,4),\"\")","v":"4770002100"},"",45.81,"","7000012242",{"$f":"IF(E4=2,VLOOKUP(B4,Tiendas!$A$3:$K$28,11),\"\")","v":""},{"$f":"IF(E4=1,VLOOKUP(B4,Tabla6[[Id Tienda]:[Cta. Banco Efectivo]],10),\"\")","v":"5720010003"},{"$f":"IF(E4=1,VLOOKUP(B4,Tabla6[[Id Tienda]:[Cta. Caja]],7),\"\")","v":"5700000042"},263.98,{"$f":"IF(E4=2,VLOOKUP(F4,Tarjetas!$A$2:$D$5,3),\"\")","v":""},{"$f":"IF(V4=\"\",\"\",VLOOKUP(F4,Tarjetas!$A$2:$D$5,4))","v":""},"","",263.98,"Venta Efec. Tienda 42 Producto 122","R",{"$f":"AC3+1","v":3},"E",{"$f":"IF(E4=1,A4+VLOOKUP(B4,Tabla6[],12),\"\")","v":{"v":42061,"d":"4206100.00%"}},{"$f":"IF(E4=2,\"Bancos Tarj. \"&Tabla5[[#This Row],[Id Tarjeta]]&\" Tienda \"&B4,\"\")","v":""},{"$f":"IF(E4=2,\"Comisión Tarj.\"&Tabla5[[#This Row],[Id Tarjeta]]&\" Tienda \"&B4,\"\")","v":""},"","Caja Tienda 42","IVA Rep. Tienda 42","Bancos Efec. Tienda 42",{"$f":"IF(E4=2,\"Venta Tarj. \"&Tabla5[[#This Row],[Id Tarjeta]]&\" Tienda \"&B4&\" Producto \"&C4,\"\")","v":""}]
[{"v":42058,"d":"4205800.00%"},15,111,685.23,2,3,"","",685.23,622.94,{"$f":"VLOOKUP(C5,Familias!$A$3:$D$8,3)","v":{"v":0.1,"d":"10.00%"}},{"$f":"IF(E5=2,VLOOKUP(C5,Familias!$A$3:$D$8,4),\"\")","v":"4770001000"},{"$f":"IF(E5=1,VLOOKUP(C5,Familias!$A$3:$D$8,4),\"\")","v":""},62.29,"","7000011115","",{"$f":"IF(E5=2,VLOOKUP(B5,Tiendas!$A$3:$K$28,11),\"\")","v":"5720020001"},{"$f":"IF(E5=1,VLOOKUP(B5,Tabla6[[Id Tienda]:[Cta. Banco Efectivo]],10),\"\")","v":""},{"$f":"IF(E5=1,VLOOKUP(B5,Tabla6[[Id Tienda]:[Cta. Caja]],7),\"\")","v":""},"",{"$f":"IF(E5=2,VLOOKUP(F5,Tarjetas!$A$2:$D$5,3),\"\")","v":{"v":0.015,"d":"1.50%"}},{"$f":"IF(V5=\"\",\"\",VLOOKUP(F5,Tarjetas!$A$2:$D$5,4))","v":"6690000003"},10.28,674.95,"","","R",4,"E",{"$f":"IF(E5=1,A5+VLOOKUP(B5,Tabla6[],12),\"\")","v":""},{"$f":"IF(E5=2,\"Bancos Tarj. \"&Tabla5[[#This Row],[Id Tarjeta]]&\" Tienda \"&B5,\"\")","v":"Bancos Tarj. 3 Tienda 15"},{"$f":"IF(E5=2,\"Comisión Tarj.\"&Tabla5[[#This Row],[Id Tarjeta]]&\" Tienda \"&B5,\"\")","v":"Comisión Tarj.3 Tienda 15"},"IVA Rep. Tienda 15","","","",{"$f":"IF(E5=2,\"Venta Tarj. \"&Tabla5[[#This Row],[Id Tarjeta]]&\" Tienda \"&B5&\" Producto \"&C5,\"\")","v":"Venta Tarj. 3 Tienda 15 Producto 111"}]
[{"v":42058,"d":"4205800.00%"},33,123,478,2,1,"","",478,395.04,{"$f":"VLOOKUP(C6,Familias!$A$3:$D$8,3)","v":{"v":0.21,"d":"21.00%"}},{"$f":"IF(E6=2,VLOOKUP(C6,Familias!$A$3:$D$8,4),\"\")","v":"4770002100"},{"$f":"IF(E6=1,VLOOKUP(C6,Familias!$A$3:$D$8,4),\"\")","v":""},82.96,"","7000012333","",{"$f":"IF(E6=2,VLOOKUP(B6,Tiendas!$A$3:$K$28,11),\"\")","v":"5720020001"},{"$f":"IF(E6=1,VLOOKUP(B6,Tabla6[[Id Tienda]:[Cta. Banco Efectivo]],10),\"\")","v":""},{"$f":"IF(E6=1,VLOOKUP(B6,Tabla6[[Id Tienda]:[Cta. Caja]],7),\"\")","v":""},"",{"$f":"IF(E6=2,VLOOKUP(F6,Tarjetas!$A$2:$D$5,3),\"\")","v":{"v":0.01,"d":"1.00%"}},{"$f":"IF(V6=\"\",\"\",VLOOKUP(F6,Tarjetas!$A$2:$D$5,4))","v":"6690000001"},4.78,473.22,"","","R",5,"E",{"$f":"IF(E6=1,A6+VLOOKUP(B6,Tabla6[],12),\"\")","v":""},{"$f":"IF(E6=2,\"Bancos Tarj. \"&Tabla5[[#This Row],[Id Tarjeta]]&\" Tienda \"&B6,\"\")","v":"Bancos Tarj. 1 Tienda 33"},{"$f":"IF(E6=2,\"Comisión Tarj.\"&Tabla5[[#This Row],[Id Tarjeta]]&\" Tienda \"&B6,\"\")","v":"Comisión Tarj.1 Tienda 33"},"IVA Rep. Tienda 33","","","",{"$f":"IF(E6=2,\"Venta Tarj. \"&Tabla5[[#This Row],[Id Tarjeta]]&\" Tienda \"&B6&\" Producto \"&C6,\"\")","v":"Venta Tarj. 1 Tienda 33 Producto 123"}]
[{"v":42058,"d":"4205800.00%"},44,112,256.33,2,4,"","",256.33,246.47,{"$f":"VLOOKUP(C7,Familias!$A$3:$D$8,3)","v":{"v":0.04,"d":"4.00%"}},{"$f":"IF(E7=2,VLOOKUP(C7,Familias!$A$3:$D$8,4),\"\")","v":"4770000400"},{"$f":"IF(E7=1,VLOOKUP(C7,Familias!$A$3:$D$8,4),\"\")","v":""},9.86,"","7000011244","",{"$f":"IF(E7=2,VLOOKUP(B7,Tiendas!$A$3:$K$28,11),\"\")","v":"5720020001"},{"$f":"IF(E7=1,VLOOKUP(B7,Tabla6[[Id Tienda]:[Cta. Banco Efectivo]],10),\"\")","v":""},{"$f":"IF(E7=1,VLOOKUP(B7,Tabla6[[Id Tienda]:[Cta. Caja]],7),\"\")","v":""},"",{"$f":"IF(E7=2,VLOOKUP(F7,Tarjetas!$A$2:$D$5,3),\"\")","v":{"v":0.0085,"d":"0.85%"}},{"$f":"IF(V7=\"\",\"\",VLOOKUP(F7,Tarjetas!$A$2:$D$5,4))","v":"6690000004"},2.18,254.15,"","","R",6,"E",{"$f":"IF(E7=1,A7+VLOOKUP(B7,Tabla6[],12),\"\")","v":""},{"$f":"IF(E7=2,\"Bancos Tarj. \"&Tabla5[[#This Row],[Id Tarjeta]]&\" Tienda \"&B7,\"\")","v":"Bancos Tarj. 4 Tienda 44"},{"$f":"IF(E7=2,\"Comisión Tarj.\"&Tabla5[[#This Row],[Id Tarjeta]]&\" Tienda \"&B7,\"\")","v":"Comisión Tarj.4 Tienda 44"},"IVA Rep. Tienda 44","","","",{"$f":"IF(E7=2,\"Venta Tarj. \"&Tabla5[[#This Row],[Id Tarjeta]]&\" Tienda \"&B7&\" Producto \"&C7,\"\")","v":"Venta Tarj. 4 Tienda 44 Producto 112"}]
[{"v":42058,"d":"4205800.00%"},42,123,300.14,1,null,300.14,248.05,"","",{"$f":"VLOOKUP(C8,Familias!$A$3:$D$8,3)","v":{"v":0.21,"d":"21.00%"}},{"$f":"IF(E8=2,VLOOKUP(C8,Familias!$A$3:$D$8,4),\"\")","v":""},{"$f":"IF(E8=1,VLOOKUP(C8,Familias!$A$3:$D$8,4),\"\")","v":"4770002100"},"",52.09,"","7000012342",{"$f":"IF(E8=2,VLOOKUP(B8,Tiendas!$A$3:$K$28,11),\"\")","v":""},{"$f":"IF(E8=1,VLOOKUP(B8,Tabla6[[Id Tienda]:[Cta. Banco Efectivo]],10),\"\")","v":"5720010003"},{"$f":"IF(E8=1,VLOOKUP(B8,Tabla6[[Id Tienda]:[Cta. Caja]],7),\"\")","v":"5700000042"},300.14,{"$f":"IF(E8=2,VLOOKUP(F8,Tarjetas!$A$2:$D$5,3),\"\")","v":""},{"$f":"IF(V8=\"\",\"\",VLOOKUP(F8,Tarjetas!$A$2:$D$5,4))","v":""},"","",300.14,"Venta Efec. Tienda 42 Producto 123","R",7,"E",{"$f":"IF(E8=1,A8+VLOOKUP(B8,Tabla6[],12),\"\")","v":{"v":42061,"d":"4206100.00%"}},{"$f":"IF(E8=2,\"Bancos Tarj. \"&Tabla5[[#This Row],[Id Tarjeta]]&\" Tienda \"&B8,\"\")","v":""},{"$f":"IF(E8=2,\"Comisión Tarj.\"&Tabla5[[#This Row],[Id Tarjeta]]&\" Tienda \"&B8,\"\")","v":""},"","Caja Tienda 42","IVA Rep. Tienda 42","Bancos Efec. Tienda 42",{"$f":"IF(E8=2,\"Venta Tarj. \"&Tabla5[[#This Row],[Id Tarjeta]]&\" Tienda \"&B8&\" Producto \"&C8,\"\")","v":""}]
[{"v":42058,"d":"4205800.00%"},53,112,127.09,1,null,127.09,122.2,"","",{"$f":"VLOOKUP(C9,Familias!$A$3:$D$8,3)","v":{"v":0.04,"d":"4.00%"}},{"$f":"IF(E9=2,VLOOKUP(C9,Familias!$A$3:$D$8,4),\"\")","v":""},{"$f":"IF(E9=1,VLOOKUP(C9,Familias!$A$3:$D$8,4),\"\")","v":"4770000400"},"",4.89,"","7000011253",{"$f":"IF(E9=2,VLOOKUP(B9,Tiendas!$A$3:$K$28,11),\"\")","v":""},{"$f":"IF(E9=1,VLOOKUP(B9,Tabla6[[Id Tienda]:[Cta. Banco Efectivo]],10),\"\")","v":"5720010002"},{"$f":"IF(E9=1,VLOOKUP(B9,Tabla6[[Id Tienda]:[Cta. Caja]],7),\"\")","v":"5700000053"},127.09,{"$f":"IF(E9=2,VLOOKUP(F9,Tarjetas!$A$2:$D$5,3),\"\")","v":""},{"$f":"IF(V9=\"\",\"\",VLOOKUP(F9,Tarjetas!$A$2:$D$5,4))","v":""},"","",127.09,"Venta Efec. Tienda 53 Producto 112","R",8,"E",{"$f":"IF(E9=1,A9+VLOOKUP(B9,Tabla6[],12),\"\")","v":{"v":42061,"d":"4206100.00%"}},{"$f":"IF(E9=2,\"Bancos Tarj. \"&Tabla5[[#This Row],[Id Tarjeta]]&\" Tienda \"&B9,\"\")","v":""},{"$f":"IF(E9=2,\"Comisión Tarj.\"&Tabla5[[#This Row],[Id Tarjeta]]&\" Tienda \"&B9,\"\")","v":""},"","Caja Tienda 53","IVA Rep. Tienda 53","Bancos Efec. Tienda 53",{"$f":"IF(E9=2,\"Venta Tarj. \"&Tabla5[[#This Row],[Id Tarjeta]]&\" Tienda \"&B9&\" Producto \"&C9,\"\")","v":""}]
[{"v":42058,"d":"4205800.00%"},61,121,111.75,1,null,111.75,92.36,"","",{"$f":"VLOOKUP(C10,Familias!$A$3:$D$8,3)","v":{"v":0.21,"d":"21.00%"}},{"$f":"IF(E10=2,VLOOKUP(C10,Familias!$A$3:$D$8,4),\"\")","v":""},{"$f":"IF(E10=1,VLOOKUP(C10,Familias!$A$3:$D$8,4),\"\")","v":"4770002100"},"",19.39,"","7000012161",{"$f":"IF(E10=2,VLOOKUP(B10,Tiendas!$A$3:$K$28,11),\"\")","v":""},{"$f":"IF(E10=1,VLOOKUP(B10,Tabla6[[Id Tienda]:[Cta. Banco Efectivo]],10),\"\")","v":"5720010006"},{"$f":"IF(E10=1,VLOOKUP(B10,Tabla6[[Id Tienda]:[Cta. Caja]],7),\"\")","v":"5700000061"},111.75,{"$f":"IF(E10=2,VLOOKUP(F10,Tarjetas!$A$2:$D$5,3),\"\")","v":""},{"$f":"IF(V10=\"\",\"\",VLOOKUP(F10,Tarjetas!$A$2:$D$5,4))","v":""},"","",111.75,"Venta Efec. Tienda 61 Producto 121","R",9,"E",{"$f":"IF(E10=1,A10+VLOOKUP(B10,Tabla6[],12),\"\")","v":{"v":42061,"d":"4206100.00%"}},{"$f":"IF(E10=2,\"Bancos Tarj. \"&Tabla5[[#This Row],[Id Tarjeta]]&\" Tienda \"&B10,\"\")","v":""},{"$f":"IF(E10=2,\"Comisión Tarj.\"&Tabla5[[#This Row],[Id Tarjeta]]&\" Tienda \"&B10,\"\")","v":""},"","Caja Tienda 61","IVA Rep. Tienda 61","Bancos Efec. Tienda 61",{"$f":"IF(E10=2,\"Venta Tarj. \"&Tabla5[[#This Row],[Id Tarjeta]]&\" Tienda \"&B10&\" Producto \"&C10,\"\")","v":""}]
[{"v":42058,"d":"4205800.00%"},63,113,123.33,2,2,"","",123.33,101.93,{"$f":"VLOOKUP(C11,Familias!$A$3:$D$8,3)","v":{"v":0.21,"d":"21.00%"}},{"$f":"IF(E11=2,VLOOKUP(C11,Familias!$A$3:$D$8,4),\"\")","v":"4770002100"},{"$f":"IF(E11=1,VLOOKUP(C11,Familias!$A$3:$D$8,4),\"\")","v":""},21.4,"","7000011363","",{"$f":"IF(E11=2,VLOOKUP(B11,Tiendas!$A$3:$K$28,11),\"\")","v":"5720020001"},{"$f":"IF(E11=1,VLOOKUP(B11,Tabla6[[Id Tienda]:[Cta. Banco Efectivo]],10),\"\")","v":""},{"$f":"IF(E11=1,VLOOKUP(B11,Tabla6[[Id Tienda]:[Cta. Caja]],7),\"\")","v":""},"",{"$f":"IF(E11=2,VLOOKUP(F11,Tarjetas!$A$2:$D$5,3),\"\")","v":{"v":0.0125,"d":"1.25%"}},{"$f":"IF(V11=\"\",\"\",VLOOKUP(F11,Tarjetas!$A$2:$D$5,4))","v":"6690000002"},1.54,121.79,"","","R",10,"E",{"$f":"IF(E11=1,A11+VLOOKUP(B11,Tabla6[],12),\"\")","v":""},{"$f":"IF(E11=2,\"Bancos Tarj. \"&Tabla5[[#This Row],[Id Tarjeta]]&\" Tienda \"&B11,\"\")","v":"Bancos Tarj. 2 Tienda 63"},{"$f":"IF(E11=2,\"Comisión Tarj.\"&Tabla5[[#This Row],[Id Tarjeta]]&\" Tienda \"&B11,\"\")","v":"Comisión Tarj.2 Tienda 63"},"IVA Rep. Tienda 63","","","",{"$f":"IF(E11=2,\"Venta Tarj. \"&Tabla5[[#This Row],[Id Tarjeta]]&\" Tienda \"&B11&\" Producto \"&C11,\"\")","v":"Venta Tarj. 2 Tienda 63 Producto 113"}]
[{"v":42058,"d":"4205800.00%"},71,111,883.22,2,3,"","",883.22,802.93,{"$f":"VLOOKUP(C12,Familias!$A$3:$D$8,3)","v":{"v":0.1,"d":"10.00%"}},{"$f":"IF(E12=2,VLOOKUP(C12,Familias!$A$3:$D$8,4),\"\")","v":"4770001000"},{"$f":"IF(E12=1,VLOOKUP(C12,Familias!$A$3:$D$8,4),\"\")","v":""},80.29,"","7000011171","",{"$f":"IF(E12=2,VLOOKUP(B12,Tiendas!$A$3:$K$28,11),\"\")","v":"5720020001"},{"$f":"IF(E12=1,VLOOKUP(B12,Tabla6[[Id Tienda]:[Cta. Banco Efectivo]],10),\"\")","v":""},{"$f":"IF(E12=1,VLOOKUP(B12,Tabla6[[Id Tienda]:[Cta. Caja]],7),\"\")","v":""},"",{"$f":"IF(E12=2,VLOOKUP(F12,Tarjetas!$A$2:$D$5,3),\"\")","v":{"v":0.015,"d":"1.50%"}},{"$f":"IF(V12=\"\",\"\",VLOOKUP(F12,Tarjetas!$A$2:$D$5,4))","v":"6690000003"},13.25,869.97,"","","R",11,"E",{"$f":"IF(E12=1,A12+VLOOKUP(B12,Tabla6[],12),\"\")","v":""},{"$f":"IF(E12=2,\"Bancos Tarj. \"&Tabla5[[#This Row],[Id Tarjeta]]&\" Tienda \"&B12,\"\")","v":"Bancos Tarj. 3 Tienda 71"},{"$f":"IF(E12=2,\"Comisión Tarj.\"&Tabla5[[#This Row],[Id Tarjeta]]&\" Tienda \"&B12,\"\")","v":"Comisión Tarj.3 Tienda 71"},"IVA Rep. Tienda 71","","","",{"$f":"IF(E12=2,\"Venta Tarj. \"&Tabla5[[#This Row],[Id Tarjeta]]&\" Tienda \"&B12&\" Producto \"&C12,\"\")","v":"Venta Tarj. 3 Tienda 71 Producto 111"}]
[{"v":42058,"d":"4205800.00%"},72,113,69.75,2,4,"","",69.75,57.64,{"$f":"VLOOKUP(C13,Familias!$A$3:$D$8,3)","v":{"v":0.21,"d":"21.00%"}},{"$f":"IF(E13=2,VLOOKUP(C13,Familias!$A$3:$D$8,4),\"\")","v":"4770002100"},{"$f":"IF(E13=1,VLOOKUP(C13,Familias!$A$3:$D$8,4),\"\")","v":""},12.11,"","7000011372","",{"$f":"IF(E13=2,VLOOKUP(B13,Tiendas!$A$3:$K$28,11),\"\")","v":"5720020001"},{"$f":"IF(E13=1,VLOOKUP(B13,Tabla6[[Id Tienda]:[Cta. Banco Efectivo]],10),\"\")","v":""},{"$f":"IF(E13=1,VLOOKUP(B13,Tabla6[[Id Tienda]:[Cta. Caja]],7),\"\")","v":""},"",{"$f":"IF(E13=2,VLOOKUP(F13,Tarjetas!$A$2:$D$5,3),\"\")","v":{"v":0.0085,"d":"0.85%"}},{"$f":"IF(V13=\"\",\"\",VLOOKUP(F13,Tarjetas!$A$2:$D$5,4))","v":"6690000004"},0.59,69.16,"","","R",12,"E",{"$f":"IF(E13=1,A13+VLOOKUP(B13,Tabla6[],12),\"\")","v":""},{"$f":"IF(E13=2,\"Bancos Tarj. \"&Tabla5[[#This Row],[Id Tarjeta]]&\" Tienda \"&B13,\"\")","v":"Bancos Tarj. 4 Tienda 72"},{"$f":"IF(E13=2,\"Comisión Tarj.\"&Tabla5[[#This Row],[Id Tarjeta]]&\" Tienda \"&B13,\"\")","v":"Comisión Tarj.4 Tienda 72"},"IVA Rep. Tienda 72","","","",{"$f":"IF(E13=2,\"Venta Tarj. \"&Tabla5[[#This Row],[Id Tarjeta]]&\" Tienda \"&B13&\" Producto \"&C13,\"\")","v":"Venta Tarj. 4 Tienda 72 Producto 113"}]
[]
[]
[]
[]
[null,null," "]

{"sheet":"AstosVentasPropias","index":20,"n_rows":109,"n_cols":17,"rows_kept":109}
["Diario","Fecha","Asiento","Orden","Cuenta","Importe Pts","Concepto","Documento","Debe","Haber","Moneda","Punteo","TipoIVA","Nº IVA","Depto.","Subdepto.","Imagen"]
[1,{"v":42058,"d":"4205800.00%"},1,1,{"$nulls":6},"E",null,"R",1]
[1,{"v":42058,"d":"4205800.00%"},1,2,{"$nulls":6},"E",null,"R",1]
[1,{"v":42058,"d":"4205800.00%"},1,3,{"$nulls":6},"E",null,"R",1]
[1,{"v":42058,"d":"4205800.00%"},1,4,{"$nulls":6},"E",null,"R",1]
[1,{"v":42058,"d":"4205800.00%"},2,1,5700000011,null,"Caja Tienda 11",null,98.36000000000001,null,"E",1,"R",1]
[1,{"v":42058,"d":"4205800.00%"},2,2,7000011311,null,"Venta Efec. Tienda 11 Producto 113",null,null,81.29,"E",null,"R",1]
[1,{"v":42058,"d":"4205800.00%"},2,3,4770002100,null,"IVA Rep. Tienda 11",null,null,17.07,"E",null,"R",1]
[1,{"v":42061,"d":"4206100.00%"},3,1,5720010003,null,"Bancos Efec. Tienda 11",null,98.36000000000001,null,"E",null,"R",1]
[1,{"v":42061,"d":"4206100.00%"},3,2,5700000011,null,"Caja Tienda 11",null,null,98.36000000000001,"E",1,"R",1]
[1,{"v":42058,"d":"4205800.00%"},4,1,5720020001,null,"Bancos Tarj. 2 Tienda 32",null,113.84,null,"E",null,"R",2]
[1,{"v":42058,"d":"4205800.00%"},4,2,6690000002,null,"Comisión Tarj.2 Tienda 32",null,1.44,null,"E",null,"R",2]
[1,{"v":42058,"d":"4205800.00%"},4,3,7000012132,null,"Venta Tarj. 2 Tienda 32 Producto 121",null,null,95.27,"E",null,"R",2]
[1,{"v":42058,"d":"4205800.00%"},4,4,4770002100,null,"IVA Rep. Tienda 32",null,null,20.01,"E",null,"R",2]
[1,{"v":42058,"d":"4205800.00%"},5,1,{"$nulls":6},"E",1,"R",2]
[1,{"v":42058,"d":"4205800.00%"},5,2,{"$nulls":6},"E",null,"R",2]
[1,{"v":42058,"d":"4205800.00%"},5,3,{"$nulls":6},"E",null,"R",2]
[1,null,6,1,{"$nulls":6},"E",null,"R",2]
[1,null,6,2,{"$nulls":6},"E",1,"R",2]
[1,{"v":42058,"d":"4205800.00%"},7,1,{"$nulls":6},"E",null,"R",3]
[1,{"v":42058,"d":"4205800.00%"},7,2,{"$nulls":6},"E",null,"R",3]
[1,{"v":42058,"d":"4205800.00%"},7,3,{"$nulls":6},"E",null,"R",3]
[1,{"v":42058,"d":"4205800.00%"},7,4,{"$nulls":6},"E",null,"R",3]
[1,{"v":42058,"d":"4205800.00%"},8,1,5700000042,null,"Caja Tienda 42",null,263.98,null,"E",1,"R",3]
[1,{"v":42058,"d":"4205800.00%"},8,2,7000012242,null,"Venta Efec. Tienda 42 Producto 122",null,null,218.17,"E",null,"R",3]
[1,{"v":42058,"d":"4205800.00%"},8,3,4770002100,null,"IVA Rep. Tienda 42",null,null,45.81,"E",null,"R",3]
[1,{"v":42061,"d":"4206100.00%"},9,1,5720010003,null,"Bancos Efec. Tienda 42",null,263.98,null,"E",null,"R",3]
[1,{"v":42061,"d":"4206100.00%"},9,2,5700000042,null,"Caja Tienda 42",null,null,263.98,"E",1,"R",3]
[1,{"v":42058,"d":"4205800.00%"},10,1,5720020001,null,"Bancos Tarj. 3 Tienda 15",null,674.95,null,"E",null,"R",4]
[1,{"v":42058,"d":"4205800.00%"},10,2,6690000003,null,"Comisión Tarj.3 Tienda 15",null,10.28,null,"E",null,"R",4]
[1,{"v":42058,"d":"4205800.00%"},10,3,7000011115,null,"Venta Tarj. 3 Tienda 15 Producto 111",null,null,622.94,"E",null,"R",4]
[1,{"v":42058,"d":"4205800.00%"},10,4,4770001000,null,"IVA Rep. Tienda 15",null,null,62.29,"E",null,"R",4]
[1,{"v":42058,"d":"4205800.00%"},11,1,{"$nulls":6},"E",1,"R",4]
[1,{"v":42058,"d":"4205800.00%"},11,2,{"$nulls":6},"E",null,"R",4]
[1,{"v":42058,"d":"4205800.00%"},11,3,{"$nulls":6},"E",null,"R",4]
[1,null,12,1,{"$nulls":6},"E",null,"R",4]
[1,null,12,2,{"$nulls":6},"E",1,"R",4]
[1,{"v":42058,"d":"4205800.00%"},13,1,5720020001,null,"Bancos Tarj. 1 Tienda 33",null,473.22,null,"E",null,"R",5]
[1,{"v":42058,"d":"4205800.00%"},13,2,6690000001,null,"Comisión Tarj.1 Tienda 33",null,4.78,null,"E",null,"R",5]
[1,{"v":42058,"d":"4205800.00%"},13,3,7000012333,null,"Venta Tarj. 1 Tienda 33 Producto 123",null,null,395.04,"E",null,"R",5]
[1,{"v":42058,"d":"4205800.00%"},13,4,4770002100,null,"IVA Rep. Tienda 33",null,null,82.96,"E",null,"R",5]
[1,{"v":42058,"d":"4205800.00%"},14,1,{"$nulls":6},"E",1,"R",5]
[1,{"v":42058,"d":"4205800.00%"},14,2,{"$nulls":6},"E",null,"R",5]
[1,{"v":42058,"d":"4205800.00%"},14,3,{"$nulls":6},"E",null,"R",5]
[1,null,15,1,{"$nulls":6},"E",null,"R",5]
[1,null,15,2,{"$nulls":6},"E",1,"R",5]
[1,{"v":42058,"d":"4205800.00%"},16,1,5720020001,null,"Bancos Tarj. 4 Tienda 44",null,254.15,null,"E",null,"R",6]
[1,{"v":42058,"d":"4205800.00%"},16,2,6690000004,null,"Comisión Tarj.4 Tienda 44",null,2.18,null,"E",null,"R",6]
[1,{"v":42058,"d":"4205800.00%"},16,3,7000011244,null,"Venta Tarj. 4 Tienda 44 Producto 112",null,null,246.47,"E",null,"R",6]
[1,{"v":42058,"d":"4205800.00%"},16,4,4770000400,null,"IVA Rep. Tienda 44",null,null,9.86,"E",null,"R",6]
[1,{"v":42058,"d":"4205800.00%"},17,1,{"$nulls":6},"E",1,"R",6]
[1,{"v":42058,"d":"4205800.00%"},17,2,{"$nulls":6},"E",null,"R",6]
[1,{"v":42058,"d":"4205800.00%"},17,3,{"$nulls":6},"E",null,"R",6]
[1,null,18,1,{"$nulls":6},"E",null,"R",6]
[1,null,18,2,{"$nulls":6},"E",1,"R",6]
[1,{"v":42058,"d":"4205800.00%"},19,1,{"$nulls":6},"E",null,"R",7]
[1,{"v":42058,"d":"4205800.00%"},19,2,{"$nulls":6},"E",null,"R",7]
[1,{"v":42058,"d":"4205800.00%"},19,3,{"$nulls":6},"E",null,"R",7]
[1,{"v":42058,"d":"4205800.00%"},19,4,{"$nulls":6},"E",null,"R",7]
[1,{"v":42058,"d":"4205800.00%"},20,1,5700000042,null,"Caja Tienda 42",null,300.14,null,"E",1,"R",7]
[1,{"v":42058,"d":"4205800.00%"},20,2,7000012342,null,"Venta Efec. Tienda 42 Producto 123",null,null,248.05,"E",null,"R",7]
[1,{"v":42058,"d":"4205800.00%"},20,3,4770002100,null,"IVA Rep. Tienda 42",null,null,52.09,"E",null,"R",7]
[1,{"v":42061,"d":"4206100.00%"},21,1,5720010003,null,"Bancos Efec. Tienda 42",null,300.14,null,"E",null,"R",7]
[1,{"v":42061,"d":"4206100.00%"},21,2,5700000042,null,"Caja Tienda 42",null,null,300.14,"E",1,"R",7]
[1,{"v":42058,"d":"4205800.00%"},22,1,{"$nulls":6},"E",null,"R",8]
[1,{"v":42058,"d":"4205800.00%"},22,2,{"$nulls":6},"E",null,"R",8]
[1,{"v":42058,"d":"4205800.00%"},22,3,{"$nulls":6},"E",null,"R",8]
[1,{"v":42058,"d":"4205800.00%"},22,4,{"$nulls":6},"E",null,"R",8]
[1,{"v":42058,"d":"4205800.00%"},23,1,5700000053,null,"Caja Tienda 53",null,127.09,null,"E",1,"R",8]
[1,{"v":42058,"d":"4205800.00%"},23,2,7000011253,null,"Venta Efec. Tienda 53 Producto 112",null,null,122.2,"E",null,"R",8]
[1,{"v":42058,"d":"4205800.00%"},23,3,4770000400,null,"IVA Rep. Tienda 53",null,null,4.89,"E",null,"R",8]
[1,{"v":42061,"d":"4206100.00%"},24,1,5720010002,null,"Bancos Efec. Tienda 53",null,127.09,null,"E",null,"R",8]
[1,{"v":42061,"d":"4206100.00%"},24,2,5700000053,null,"Caja Tienda 53",null,null,127.09,"E",1,"R",8]
[1,{"v":42058,"d":"4205800.00%"},25,1,{"$nulls":6},"E",null,"R",9]
[1,{"v":42058,"d":"4205800.00%"},25,2,{"$nulls":6},"E",null,"R",9]
[1,{"v":42058,"d":"4205800.00%"},25,3,{"$nulls":6},"E",null,"R",9]
[1,{"v":42058,"d":"4205800.00%"},25,4,{"$nulls":6},"E",null,"R",9]
[1,{"v":42058,"d":"4205800.00%"},26,1,5700000061,null,"Caja Tienda 61",null,111.75,null,"E",1,"R",9]
[1,{"v":42058,"d":"4205800.00%"},26,2,7000012161,null,"Venta Efec. Tienda 61 Producto 121",null,null,92.36,"E",null,"R",9]
[1,{"v":42058,"d":"4205800.00%"},26,3,4770002100,null,"IVA Rep. Tienda 61",null,null,19.39,"E",null,"R",9]
[1,{"v":42061,"d":"4206100.00%"},27,1,5720010006,null,"Bancos Efec. Tienda 61",null,111.75,null,"E",null,"R",9]
[1,{"v":42061,"d":"4206100.00%"},27,2,5700000061,null,"Caja Tienda 61",null,null,111.75,"E",1,"R",9]
[1,{"v":42058,"d":"4205800.00%"},28,1,5720020001,null,"Bancos Tarj. 2 Tienda 63",null,121.79,null,"E",null,"R",10]
[1,{"v":42058,"d":"4205800.00%"},28,2,6690000002,null,"Comisión Tarj.2 Tienda 63",null,1.54,null,"E",null,"R",10]
[1,{"v":42058,"d":"4205800.00%"},28,3,7000011363,null,"Venta Tarj. 2 Tienda 63 Producto 113",null,null,101.93,"E",null,"R",10]
[1,{"v":42058,"d":"4205800.00%"},28,4,4770002100,null,"IVA Rep. Tienda 63",null,null,21.4,"E",null,"R",10]
[1,{"v":42058,"d":"4205800.00%"},29,1,{"$nulls":6},"E",1,"R",10]
[1,{"v":42058,"d":"4205800.00%"},29,2,{"$nulls":6},"E",null,"R",10]
[1,{"v":42058,"d":"4205800.00%"},29,3,{"$nulls":6},"E",null,"R",10]
[1,null,30,1,{"$nulls":6},"E",null,"R",10]
[1,null,30,2,{"$nulls":6},"E",1,"R",10]
[1,{"v":42058,"d":"4205800.00%"},31,1,5720020001,null,"Bancos Tarj. 3 Tienda 71",null,869.97,null,"E",null,"R",11]
[1,{"v":42058,"d":"4205800.00%"},31,2,6690000003,null,"Comisión Tarj.3 Tienda 71",null,13.25,null,"E",null,"R",11]
[1,{"v":42058,"d":"4205800.00%"},31,3,7000011171,null,"Venta Tarj. 3 Tienda 71 Producto 111",null,null,802.93,"E",null,"R",11]
[1,{"v":42058,"d":"4205800.00%"},31,4,4770001000,null,"IVA Rep. Tienda 71",null,null,80.29,"E",null,"R",11]
[1,{"v":42058,"d":"4205800.00%"},32,1,{"$nulls":6},"E",1,"R",11]
[1,{"v":42058,"d":"4205800.00%"},32,2,{"$nulls":6},"E",null,"R",11]
[1,{"v":42058,"d":"4205800.00%"},32,3,{"$nulls":6},"E",null,"R",11]
[1,null,33,1,{"$nulls":6},"E",null,"R",11]
[1,null,33,2,{"$nulls":6},"E",1,"R",11]
[1,{"v":42058,"d":"4205800.00%"},34,1,5720020001,null,"Bancos Tarj. 4 Tienda 72",null,69.16,null,"E",null,"R",12]
[1,{"v":42058,"d":"4205800.00%"},34,2,6690000004,null,"Comisión Tarj.4 Tienda 72",null,0.59,null,"E",null,"R",12]
[1,{"v":42058,"d":"4205800.00%"},34,3,7000011372,null,"Venta Tarj. 4 Tienda 72 Producto 113",null,null,57.64,"E",null,"R",12]
[1,{"v":42058,"d":"4205800.00%"},34,4,4770002100,null,"IVA Rep. Tienda 72",null,null,12.11,"E",null,"R",12]
[1,{"v":42058,"d":"4205800.00%"},35,1,{"$nulls":6},"E",1,"R",12]
[1,{"v":42058,"d":"4205800.00%"},35,2,{"$nulls":6},"E",null,"R",12]
[1,{"v":42058,"d":"4205800.00%"},35,3,{"$nulls":6},"E",null,"R",12]
[1,null,36,1,{"$nulls":6},"E",null,"R",12]
[1,null,36,2,{"$nulls":6},"E",1,"R",12]

{"sheet":"ConfigPagosTPV","index":21,"n_rows":25,"n_cols":17,"rows_kept":25,"merged":[[0,3,0,5],[1,3,1,5]]}
["Hoja con los datos de entrada:",null,null,"PagosTPV"]
["Datos de salida:",null,null,"AstosPagosTPV"]
["Primer número de asiento:",null,null,1]
["Procedimientos a ejecutar previamente:",{"$nulls":3},"Macro9","Macro10"]
[]
[]
[]
[]
["Diario","Fecha","Asiento","Orden","Cuenta","Importe Pts","Concepto","Documento","Debe","Haber","Moneda","Punteo","TipoIVA","Nº IVA","Depto.","Subdepto.","Imagen"]
[1,"A","#1",1,"M",null,"L",null,"K",null,"AM",null,"AN","AO"]
[1,"A","#1",2,"O",null,"N",null,null,"K","AM",null,"AN","AO"]
[1,"A","#2",1,"R",null,"Q",null,"P",null,"AM",null,"AN","AO"]
[1,"A","#2",2,"T",null,"S",null,null,"P","AM",null,"AN","AO"]
[1,"A","#3",1,"X",null,"Y",null,"V",null,"AM",null,"AN","AO"]
[1,"A","#3",2,"I",null,"Z",null,"W",null,"AM",null,"AN","AO"]
[1,"A","#3",3,"AA",null,"AB",null,null,"U","AM",null,"AN","AO"]
[1,"A","#4",1,"AD",null,"AE",null,"AC",null,"AM",null,"AN","AO"]
[1,"A","#4",2,"AF",null,"AG",null,null,"AC","AM",null,"AN","AO"]
[1,"A","#5",1,"AI",null,"AJ",null,"AH",null,"AM",null,"AN","AO"]
[1,"A","#5",2,"AK",null,"AL",null,null,"AH","AM",null,"AN","AO"]
[]
[]
[]
[]
[{"$nulls":7}," "]

{"sheet":"PagosTPV","index":22,"n_rows":13,"n_cols":41,"rows_kept":13}
["Fecha","ID Pago","Importe","Id Tienda","Id empleado","Nombre gasto/Ing","Cta. Gasto/Ing.","% IVA","Cta. IVA","Cta. Efectivo","Imp. Anticipo","Conc.  Anticipo","Cta. Debe Anticipo","Conc. Efectivo Antip.","Cta. Haber Anticipo","Imp. Devolución ant.","Conc. Devolución","Cta. Debe Devolución","Conc. Gto.Devol.","Cta. Haber Devol.","Imp. Efectivo gastos","Imp. Gastos (Sin IVA)","Imp. IVA Gastos","Cta. Gastos ","Conc. Gastos","Conc. IVA Gastos","Cta. Efectivo ","Conc. Efectivo","Imp. Faltante","Cta. Pérdida Arque.","Conc. Pérd. Arque","Cta. Efectivo Arq. Faltante","Conc. Efec. Arq. Faltante","Imp. Arq. Sobrante","Cta. Efec. Arq. Sobrante","Conc. Efec. Arq. Sobrante","Cta. Ingr. arqueo","Conc. Ingreso arqueo","Moneda","Tipo IVA","nº IVA"]
[{"v":42058,"d":"4205800.00%"},3,5.96,11,{"$f":"IF((OR(B2=1,B2=2)),VLOOKUP(D2,Nóminas!$A$2:$B$22,2),\"\")","v":""},{"$f":"VLOOKUP(B2,'Pagos tienda'!$A$2:$B$13,2)","v":"Papelería"},{"$f":"VLOOKUP(B2,'Pagos tienda'!$A$2:$C$13,3)&\"00000\"&D2","v":"6020000011"},{"$f":"VLOOKUP(Tabla4[[#This Row],[ID Pago]],Tabla14[[IdPago]:[% IVA]],6)","v":{"v":0.21,"d":"21.00%"}},{"$f":"VLOOKUP(B2,'Pagos tienda'!$A$2:$H$13,7)","v":"4720002100"},{"$f":"VLOOKUP(D2,Tiendas!$A$2:$G$27,7)","v":"5700000011"},{"$f":"IF(B2=1,C2,\"\")","v":""},{"$f":"IF(B2=1,\"Anticipo empleado \"&E2,\"\")","v":""},{"$f":"IF(B2=1,G2,\"\")","v":""},{"$f":"IF(B2=1,\"Efectivo empleado \"&E2,\"\")","v":""},{"$f":"IF(B2=1,J2,\"\")","v":""},{"$f":"IF(B2=2,C2,\"\")","v":""},{"$f":"IF(B2=2,\"Efectivo Tienda \"&Tabla4[[#This Row],[Id Tienda]],\"\")","v":""},{"$f":"IF(B2=2,J2,\"\")","v":""},{"$f":"IF(B2=2,\"Devolución Anticipo \"&E2,\"\")","v":""},{"$f":"IF(B2=2,G2,\"\")","v":""},{"$f":"IF(OR(B2=3,B2=4,B2=5,B2=6,B2=7,B2=8,B2=9,B2=10),C2,\"\")","v":5.96},{"$f":"IF(U2=\"\",\"\",IF(U2<6,U2,ROUND(U2/(1+H2),2)))","v":5.96},{"$f":"IF(U2=\"\",\"\",IF(U2>6,U2-V2,0))","v":0},{"$f":"IF(OR(B2=3,B2=4,B2=5,B2=6,B2=7,B2=8,B2=9,B2=10),G2,\"\")","v":"6020000011"},{"$f":"IF(OR(B2=3,B2=4,B2=5,B2=6,B2=7,B2=8,B2=9,B2=10),\"Gasto \"&F2&\" Tienda \"&D2,\"\")","v":"Gasto Papelería Tienda 11"},{"$f":"IF(OR(U2<6,U2=\"\"),\"\",\"IVA soportado Tienda \"&Tabla4[[#This Row],[Id Tienda]])","v":""},{"$f":"IF(OR(B2=3,B2=4,B2=5,B2=6,B2=7,B2=8,B2=9,B2=10),J2,\"\")","v":"5700000011"},{"$f":"IF(OR(B2=3,B2=4,B2=5,B2=6,B2=7,B2=8,B2=9,B2=10),\"Efectivo Tienda \"&D2,\"\")","v":"Efectivo Tienda 11"},{"$f":"IF(B2=11,C2,\"\")","v":""},{"$f":"IF(B2=11,G2,\"\")","v":""},{"$f":"IF(B2=11,\"Otras pérdidas en gestión corriente Tienda \"&D2,\"\")","v":""},{"$f":"IF(B2=11,J2,\"\")","v":""},{"$f":"IF(B2=11,\"Efectivo Tienda \"&D2,\"\")","v":""},{"$f":"IF(B2=12,C2,\"\")","v":""},{"$f":"IF(B2=12,J2,\"\")","v":""},{"$f":"IF(B2=12,\"Efectivo Tienda \"&D2,\"\")","v":""},{"$f":"IF(B2=12,G2,\"\")","v":""},{"$f":"IF(B2=12,\"Ingreso por arqueo sobrante Tienda \"&D2,\"\")","v":""},"E","S",1]
[{"v":42058,"d":"4205800.00%"},4,235.69,33,{"$f":"IF((OR(B3=1,B3=2)),VLOOKUP(D3,Nóminas!$A$2:$B$22,2),\"\")","v":""},{"$f":"VLOOKUP(B3,'Pagos tienda'!$A$2:$B$13,2)","v":"Transportes locales"},{"$f":"VLOOKUP(B3,'Pagos tienda'!$A$2:$C$13,3)&\"00000\"&D3","v":"6240000033"},{"$f":"VLOOKUP(Tabla4[[#This Row],[ID Pago]],Tabla14[[IdPago]:[% IVA]],6)","v":{"v":0.21,"d":"21.00%"}},{"$f":"VLOOKUP(B3,'Pagos tienda'!$A$2:$H$13,7)","v":"4720002100"},{"$f":"VLOOKUP(D3,Tiendas!$A$2:$G$27,7)","v":"5700000033"},{"$f":"IF(B3=1,C3,\"\")","v":""},{"$f":"IF(B3=1,\"Anticipo empleado \"&E3,\"\")","v":""},{"$f":"IF(B3=1,G3,\"\")","v":""},{"$f":"IF(B3=1,\"Efectivo empleado \"&E3,\"\")","v":""},{"$f":"IF(B3=1,J3,\"\")","v":""},{"$f":"IF(B3=2,C3,\"\")","v":""},{"$f":"IF(B3=2,\"Efectivo Tienda \"&Tabla4[[#This Row],[Id Tienda]],\"\")","v":""},{"$f":"IF(B3=2,J3,\"\")","v":""},{"$f":"IF(B3=2,\"Devolución Anticipo \"&E3,\"\")","v":""},{"$f":"IF(B3=2,G3,\"\")","v":""},{"$f":"IF(OR(B3=3,B3=4,B3=5,B3=6,B3=7,B3=8,B3=9,B3=10),C3,\"\")","v":235.69},{"$f":"IF(U3=\"\",\"\",IF(U3<6,U3,ROUND(U3/(1+H3),2)))","v":194.79},{"$f":"IF(U3=\"\",\"\",IF(U3>6,U3-V3,0))","v":40.900000000000006},{"$f":"IF(OR(B3=3,B3=4,B3=5,B3=6,B3=7,B3=8,B3=9,B3=10),G3,\"\")","v":"6240000033"},{"$f":"IF(OR(B3=3,B3=4,B3=5,B3=6,B3=7,B3=8,B3=9,B3=10),\"Gasto \"&F3&\" Tienda \"&D3,\"\")","v":"Gasto Transportes locales Tienda 33"},{"$f":"IF(OR(U3<6,U3=\"\"),\"\",\"IVA soportado Tienda \"&Tabla4[[#This Row],[Id Tienda]])","v":"IVA soportado Tienda 33"},{"$f":"IF(OR(B3=3,B3=4,B3=5,B3=6,B3=7,B3=8,B3=9,B3=10),J3,\"\")","v":"5700000033"},{"$f":"IF(OR(B3=3,B3=4,B3=5,B3=6,B3=7,B3=8,B3=9,B3=10),\"Efectivo Tienda \"&D3,\"\")","v":"Efectivo Tienda 33"},{"$f":"IF(B3=11,C3,\"\")","v":""},{"$f":"IF(B3=11,G3,\"\")","v":""},{"$f":"IF(B3=11,\"Otras pérdidas en gestión corriente Tienda \"&D3,\"\")","v":""},{"$f":"IF(B3=11,J3,\"\")","v":""},{"$f":"IF(B3=11,\"Efectivo Tienda \"&D3,\"\")","v":""},{"$f":"IF(B3=12,C3,\"\")","v":""},{"$f":"IF(B3=12,J3,\"\")","v":""},{"$f":"IF(B3=12,\"Efectivo Tienda \"&D3,\"\")","v":""},{"$f":"IF(B3=12,G3,\"\")","v":""},{"$f":"IF(B3=12,\"Ingreso por arqueo sobrante Tienda \"&D3,\"\")","v":""},"E","S",{"$f":"1+AO2","v":2}]
[{"v":42058,"d":"4205800.00%"},12,1.45,32,{"$f":"IF((OR(B4=1,B4=2)),VLOOKUP(D4,Nóminas!$A$2:$B$22,2),\"\")","v":""},{"$f":"VLOOKUP(B4,'Pagos tienda'!$A$2:$B$13,2)","v":"Diferencias de arqueo (sobrante)"},{"$f":"VLOOKUP(B4,'Pagos tienda'!$A$2:$C$13,3)&\"00000\"&D4","v":"7560000032"},{"$f":"VLOOKUP(Tabla4[[#This Row],[ID Pago]],Tabla14[[IdPago]:[% IVA]],6)","v":{"v":0,"d":"0.00%"}},{"$f":"VLOOKUP(B4,'Pagos tienda'!$A$2:$H$13,7)","v":""},{"$f":"VLOOKUP(D4,Tiendas!$A$2:$G$27,7)","v":"5700000032"},"","","","","","",{"$f":"IF(B4=2,\"Efectivo Tienda \"&Tabla4[[#This Row],[Id Tienda]],\"\")","v":""},"","","","","","","","",{"$f":"IF(OR(U4<6,U4=\"\"),\"\",\"IVA soportado Tienda \"&Tabla4[[#This Row],[Id Tienda]])","v":""},"","","","","","","",1.45,"5700000032","Efectivo Tienda 32","7560000032","Ingreso por arqueo sobrante Tienda 32","E","S",{"$f":"1+AO3","v":3}]
[{"v":42058,"d":"4205800.00%"},8,8.25,44,{"$f":"IF((OR(B5=1,B5=2)),VLOOKUP(D5,Nóminas!$A$2:$B$22,2),\"\")","v":""},{"$f":"VLOOKUP(B5,'Pagos tienda'!$A$2:$B$13,2)","v":"Reparaciones básicas"},{"$f":"VLOOKUP(B5,'Pagos tienda'!$A$2:$C$13,3)&\"00000\"&D5","v":"6220000044"},{"$f":"VLOOKUP(Tabla4[[#This Row],[ID Pago]],Tabla14[[IdPago]:[% IVA]],6)","v":{"v":0.21,"d":"21.00%"}},{"$f":"VLOOKUP(B5,'Pagos tienda'!$A$2:$H$13,7)","v":"4720002100"},{"$f":"VLOOKUP(D5,Tiendas!$A$2:$G$27,7)","v":"5700000044"},"","","","","","",{"$f":"IF(B5=2,\"Efectivo Tienda \"&Tabla4[[#This Row],[Id Tienda]],\"\")","v":""},"","","",8.25,6.82,1.4299999999999997,"6220000044","Gasto Reparaciones básicas Tienda 44",{"$f":"IF(OR(U5<6,U5=\"\"),\"\",\"IVA soportado Tienda \"&Tabla4[[#This Row],[Id Tienda]])","v":"IVA soportado Tienda 44"},"5700000044","Efectivo Tienda 44","","","","","","","","","","","E","S",4]
[{"v":42058,"d":"4205800.00%"},9,365.25,62,{"$f":"IF((OR(B6=1,B6=2)),VLOOKUP(D6,Nóminas!$A$2:$B$22,2),\"\")","v":""},{"$f":"VLOOKUP(B6,'Pagos tienda'!$A$2:$B$13,2)","v":"Impuestos locales"},{"$f":"VLOOKUP(B6,'Pagos tienda'!$A$2:$C$13,3)&\"00000\"&D6","v":"6310000062"},{"$f":"VLOOKUP(Tabla4[[#This Row],[ID Pago]],Tabla14[[IdPago]:[% IVA]],6)","v":{"v":0.21,"d":"21.00%"}},{"$f":"VLOOKUP(B6,'Pagos tienda'!$A$2:$H$13,7)","v":"4720002100"},{"$f":"VLOOKUP(D6,Tiendas!$A$2:$G$27,7)","v":"5700000062"},"","","","","","",{"$f":"IF(B6=2,\"Efectivo Tienda \"&Tabla4[[#This Row],[Id Tienda]],\"\")","v":""},"","","",365.25,301.86,63.389999999999986,"6310000062","Gasto Impuestos locales Tienda 62",{"$f":"IF(OR(U6<6,U6=\"\"),\"\",\"IVA soportado Tienda \"&Tabla4[[#This Row],[Id Tienda]])","v":"IVA soportado Tienda 62"},"5700000062","Efectivo Tienda 62","","","","","","","","","","","E","S",5]
[{"v":42058,"d":"4205800.00%"},4,263,63,{"$f":"IF((OR(B7=1,B7=2)),VLOOKUP(D7,Nóminas!$A$2:$B$22,2),\"\")","v":""},{"$f":"VLOOKUP(B7,'Pagos tienda'!$A$2:$B$13,2)","v":"Transportes locales"},{"$f":"VLOOKUP(B7,'Pagos tienda'!$A$2:$C$13,3)&\"00000\"&D7","v":"6240000063"},{"$f":"VLOOKUP(Tabla4[[#This Row],[ID Pago]],Tabla14[[IdPago]:[% IVA]],6)","v":{"v":0.21,"d":"21.00%"}},{"$f":"VLOOKUP(B7,'Pagos tienda'!$A$2:$H$13,7)","v":"4720002100"},{"$f":"VLOOKUP(D7,Tiendas!$A$2:$G$27,7)","v":"5700000063"},"","","","","","",{"$f":"IF(B7=2,\"Efectivo Tienda \"&Tabla4[[#This Row],[Id Tienda]],\"\")","v":""},"","","",263,217.36,45.639999999999986,"6240000063","Gasto Transportes locales Tienda 63",{"$f":"IF(OR(U7<6,U7=\"\"),\"\",\"IVA soportado Tienda \"&Tabla4[[#This Row],[Id Tienda]])","v":"IVA soportado Tienda 63"},"5700000063","Efectivo Tienda 63","","","","","","","","","","","E","S",6]
[{"v":42058,"d":"4205800.00%"},7,630,72,{"$f":"IF((OR(B8=1,B8=2)),VLOOKUP(D8,Nóminas!$A$2:$B$22,2),\"\")","v":""},{"$f":"VLOOKUP(B8,'Pagos tienda'!$A$2:$B$13,2)","v":"Alquiler del local"},{"$f":"VLOOKUP(B8,'Pagos tienda'!$A$2:$C$13,3)&\"00000\"&D8","v":"6210000072"},{"$f":"VLOOKUP(Tabla4[[#This Row],[ID Pago]],Tabla14[[IdPago]:[% IVA]],6)","v":{"v":0.21,"d":"21.00%"}},{"$f":"VLOOKUP(B8,'Pagos tienda'!$A$2:$H$13,7)","v":"4720002100"},{"$f":"VLOOKUP(D8,Tiendas!$A$2:$G$27,7)","v":"5700000072"},"","","","","","",{"$f":"IF(B8=2,\"Efectivo Tienda \"&Tabla4[[#This Row],[Id Tienda]],\"\")","v":""},"","","",630,520.66,109.34000000000003,"6210000072","Gasto Alquiler del local Tienda 72",{"$f":"IF(OR(U8<6,U8=\"\"),\"\",\"IVA soportado Tienda \"&Tabla4[[#This Row],[Id Tienda]])","v":"IVA soportado Tienda 72"},"5700000072","Efectivo Tienda 72","","","","","","","","","","","E","S",7]
[{"v":42058,"d":"4205800.00%"},1,1050,15,15,{"$f":"VLOOKUP(B9,'Pagos tienda'!$A$2:$B$13,2)","v":"Anticipos a empleados"},{"$f":"VLOOKUP(B9,'Pagos tienda'!$A$2:$C$13,3)&\"00000\"&D9","v":"4600000015"},{"$f":"VLOOKUP(Tabla4[[#This Row],[ID Pago]],Tabla14[[IdPago]:[% IVA]],6)","v":{"v":0,"d":"0.00%"}},{"$f":"VLOOKUP(B9,'Pagos tienda'!$A$2:$H$13,7)","v":""},{"$f":"VLOOKUP(D9,Tiendas!$A$2:$G$27,7)","v":"5700000015"},1050,"Anticipo empleado 15","4600000015","Efectivo empleado 15","5700000015","",{"$f":"IF(B9=2,\"Efectivo Tienda \"&Tabla4[[#This Row],[Id Tienda]],\"\")","v":""},"","","","","","","","",{"$f":"IF(OR(U9<6,U9=\"\"),\"\",\"IVA soportado Tienda \"&Tabla4[[#This Row],[Id Tienda]])","v":""},"","","","","","","","","","","","","E","S",8]
[{"v":42058,"d":"4205800.00%"},2,1050,72,20,{"$f":"VLOOKUP(B10,'Pagos tienda'!$A$2:$B$13,2)","v":"Devolución de anticipos a empleados"},{"$f":"VLOOKUP(B10,'Pagos tienda'!$A$2:$C$13,3)&\"00000\"&D10","v":"4600000072"},{"$f":"VLOOKUP(Tabla4[[#This Row],[ID Pago]],Tabla14[[IdPago]:[% IVA]],6)","v":{"v":0,"d":"0.00%"}},{"$f":"VLOOKUP(B10,'Pagos tienda'!$A$2:$H$13,7)","v":""},{"$f":"VLOOKUP(D10,Tiendas!$A$2:$G$27,7)","v":"5700000072"},"","","","","",1050,{"$f":"IF(B10=2,\"Efectivo Tienda \"&Tabla4[[#This Row],[Id Tienda]],\"\")","v":"Efectivo Tienda 72"},"5700000072","Devolución Anticipo 20","4600000072","","","","","",{"$f":"IF(OR(U10<6,U10=\"\"),\"\",\"IVA soportado Tienda \"&Tabla4[[#This Row],[Id Tienda]])","v":""},"","","","","","","","","","","","","E","S",9]
[{"v":42058,"d":"4205800.00%"},10,73,71,{"$f":"IF((OR(B11=1,B11=2)),VLOOKUP(D11,Nóminas!$A$2:$B$22,2),\"\")","v":""},{"$f":"VLOOKUP(B11,'Pagos tienda'!$A$2:$B$13,2)","v":"Comunidad de propietarios"},{"$f":"VLOOKUP(B11,'Pagos tienda'!$A$2:$C$13,3)&\"00000\"&D11","v":"6290000071"},{"$f":"VLOOKUP(Tabla4[[#This Row],[ID Pago]],Tabla14[[IdPago]:[% IVA]],6)","v":{"v":0.21,"d":"21.00%"}},{"$f":"VLOOKUP(B11,'Pagos tienda'!$A$2:$H$13,7)","v":"4720002100"},{"$f":"VLOOKUP(D11,Tiendas!$A$2:$G$27,7)","v":"5700000071"},"","","","","","",{"$f":"IF(B11=2,\"Efectivo Tienda \"&Tabla4[[#This Row],[Id Tienda]],\"\")","v":""},"","","",73,60.33,12.670000000000002,"6290000071","Gasto Comunidad de propietarios Tienda 71",{"$f":"IF(OR(U11<6,U11=\"\"),\"\",\"IVA soportado Tienda \"&Tabla4[[#This Row],[Id Tienda]])","v":"IVA soportado Tienda 71"},"5700000071","Efectivo Tienda 71","","","","","","","","","","","E","S",10]
[{"v":42058,"d":"4205800.00%"},11,3.54,42,{"$f":"IF((OR(B12=1,B12=2)),VLOOKUP(D12,Nóminas!$A$2:$B$22,2),\"\")","v":""},{"$f":"VLOOKUP(B12,'Pagos tienda'!$A$2:$B$13,2)","v":"Diferencias de arqueo (faltante)"},{"$f":"VLOOKUP(B12,'Pagos tienda'!$A$2:$C$13,3)&\"00000\"&D12","v":"6590000042"},{"$f":"VLOOKUP(Tabla4[[#This Row],[ID Pago]],Tabla14[[IdPago]:[% IVA]],6)","v":{"v":0,"d":"0.00%"}},{"$f":"VLOOKUP(B12,'Pagos tienda'!$A$2:$H$13,7)","v":""},{"$f":"VLOOKUP(D12,Tiendas!$A$2:$G$27,7)","v":"5700000042"},"","","","","","",{"$f":"IF(B12=2,\"Efectivo Tienda \"&Tabla4[[#This Row],[Id Tienda]],\"\")","v":""},"","","","","","","","",{"$f":"IF(OR(U12<6,U12=\"\"),\"\",\"IVA soportado Tienda \"&Tabla4[[#This Row],[Id Tienda]])","v":""},"","",3.54,"6590000042","Otras pérdidas en gestión corriente Tienda 42","5700000042","Efectivo Tienda 42","","","","","","E","S",11]
[{"v":42058,"d":"4205800.00%"},6,147.3,32,{"$f":"IF((OR(B13=1,B13=2)),VLOOKUP(D13,Nóminas!$A$2:$B$22,2),\"\")","v":""},{"$f":"VLOOKUP(B13,'Pagos tienda'!$A$2:$B$13,2)","v":"Mantenimiento inmovilizado"},{"$f":"VLOOKUP(B13,'Pagos tienda'!$A$2:$C$13,3)&\"00000\"&D13","v":"6220000032"},{"$f":"VLOOKUP(Tabla4[[#This Row],[ID Pago]],Tabla14[[IdPago]:[% IVA]],6)","v":{"v":0.21,"d":"21.00%"}},{"$f":"VLOOKUP(B13,'Pagos tienda'!$A$2:$H$13,7)","v":"4720002100"},{"$f":"VLOOKUP(D13,Tiendas!$A$2:$G$27,7)","v":"5700000032"},"","","","","","",{"$f":"IF(B13=2,\"Efectivo Tienda \"&Tabla4[[#This Row],[Id Tienda]],\"\")","v":""},"","","",147.3,121.74,25.560000000000016,"6220000032","Gasto Mantenimiento inmovilizado Tienda 32",{"$f":"IF(OR(U13<6,U13=\"\"),\"\",\"IVA soportado Tienda \"&Tabla4[[#This Row],[Id Tienda]])","v":"IVA soportado Tienda 32"},"5700000032","Efectivo Tienda 32","","","","","","","","","","","E","S",12]

{"sheet":"AstosPagosTPV","index":23,"n_rows":133,"n_cols":17,"rows_kept":133}
["Diario","Fecha","Asiento","Orden","Cuenta","Importe Pts","Concepto","Documento","Debe","Haber","Moneda","Punteo","TipoIVA","Nº IVA","Depto.","Subdepto.","Imagen"]
[1,{"v":42058,"d":"4205800.00%"},1,1,{"$nulls":6},"E",null,"S",1]
[1,{"v":42058,"d":"4205800.00%"},1,2,{"$nulls":6},"E",null,"S",1]
[1,{"v":42058,"d":"4205800.00%"},2,1,{"$nulls":6},"E",null,"S",1]
[1,{"v":42058,"d":"4205800.00%"},2,2,{"$nulls":6},"E",null,"S",1]
[1,{"v":42058,"d":"4205800.00%"},3,1,6020000011,null,"Gasto Papelería Tienda 11",null,5.96,null,"E",null,"S",1]
[1,{"v":42058,"d":"4205800.00%"},3,2,4720002100,{"$nulls":3},0,null,"E",null,"S",1]
[1,{"v":42058,"d":"4205800.00%"},3,3,5700000011,null,"Efectivo Tienda 11",null,null,5.96,"E",null,"S",1]
[1,{"v":42058,"d":"4205800.00%"},4,1,{"$nulls":6},"E",null,"S",1]
[1,{"v":42058,"d":"4205800.00%"},4,2,{"$nulls":6},"E",null,"S",1]
[1,{"v":42058,"d":"4205800.00%"},5,1,{"$nulls":6},"E",null,"S",1]
[1,{"v":42058,"d":"4205800.00%"},5,2,{"$nulls":6},"E",null,"S",1]
[1,{"v":42058,"d":"4205800.00%"},6,1,{"$nulls":6},"E",null,"S",2]
[1,{"v":42058,"d":"4205800.00%"},6,2,{"$nulls":6},"E",null,"S",2]
[1,{"v":42058,"d":"4205800.00%"},7,1,{"$nulls":6},"E",null,"S",2]
[1,{"v":42058,"d":"4205800.00%"},7,2,{"$nulls":6},"E",null,"S",2]
[1,{"v":42058,"d":"4205800.00%"},8,1,6240000033,null,"Gasto Transportes locales Tienda 33",null,194.79,null,"E",null,"S",2]
[1,{"v":42058,"d":"4205800.00%"},8,2,4720002100,null,"IVA soportado Tienda 33",null,40.900000000000006,null,"E",null,"S",2]
[1,{"v":42058,"d":"4205800.00%"},8,3,5700000033,null,"Efectivo Tienda 33",null,null,235.69,"E",null,"S",2]
[1,{"v":42058,"d":"4205800.00%"},9,1,{"$nulls":6},"E",null,"S",2]
[1,{"v":42058,"d":"4205800.00%"},9,2,{"$nulls":6},"E",null,"S",2]
[1,{"v":42058,"d":"4205800.00%"},10,1,{"$nulls":6},"E",null,"S",2]
[1,{"v":42058,"d":"4205800.00%"},10,2,{"$nulls":6},"E",null,"S",2]
[1,{"v":42058,"d":"4205800.00%"},11,1,{"$nulls":6},"E",null,"S",3]
[1,{"v":42058,"d":"4205800.00%"},11,2,{"$nulls":6},"E",null,"S",3]
[1,{"v":42058,"d":"4205800.00%"},12,1,{"$nulls":6},"E",null,"S",3]
[1,{"v":42058,"d":"4205800.00%"},12,2,{"$nulls":6},"E",null,"S",3]
[1,{"v":42058,"d":"4205800.00%"},13,1,{"$nulls":6},"E",null,"S",3]
[1,{"v":42058,"d":"4205800.00%"},13,2,{"$nulls":6},"E",null,"S",3]
[1,{"v":42058,"d":"4205800.00%"},13,3,{"$nulls":6},"E",null,"S",3]
[1,{"v":42058,"d":"4205800.00%"},14,1,{"$nulls":6},"E",null,"S",3]
[1,{"v":42058,"d":"4205800.00%"},14,2,{"$nulls":6},"E",null,"S",3]
[1,{"v":42058,"d":"4205800.00%"},15,1,5700000032,null,"Efectivo Tienda 32",null,1.45,null,"E",null,"S",3]
[1,{"v":42058,"d":"4205800.00%"},15,2,7560000032,null,"Ingreso arqueo sobrante Tienda 32",null,null,1.45,"E",null,"S",3]
[1,{"v":42058,"d":"4205800.00%"},16,1,{"$nulls":6},"E",null,"S",4]
[1,{"v":42058,"d":"4205800.00%"},16,2,{"$nulls":6},"E",null,"S",4]
[1,{"v":42058,"d":"4205800.00%"},17,1,{"$nulls":6},"E",null,"S",4]
[1,{"v":42058,"d":"4205800.00%"},17,2,{"$nulls":6},"E",null,"S",4]
[1,{"v":42058,"d":"4205800.00%"},18,1,6220000044,null,"Gasto Reparaciones básicas Tienda 44",null,6.82,null,"E",null,"S",4]
[1,{"v":42058,"d":"4205800.00%"},18,2,4720002100,null,"IVA soportado Tienda 44",null,1.4299999999999997,null,"E",null,"S",4]
[1,{"v":42058,"d":"4205800.00%"},18,3,5700000044,null,"Efectivo Tienda 44",null,null,8.25,"E",null,"S",4]
[1,{"v":42058,"d":"4205800.00%"},19,1,{"$nulls":6},"E",null,"S",4]
[1,{"v":42058,"d":"4205800.00%"},19,2,{"$nulls":6},"E",null,"S",4]
[1,{"v":42058,"d":"4205800.00%"},20,1,{"$nulls":6},"E",null,"S",4]
[1,{"v":42058,"d":"4205800.00%"},20,2,{"$nulls":6},"E",null,"S",4]
[1,{"v":42058,"d":"4205800.00%"},21,1,{"$nulls":6},"E",null,"S",5]
[1,{"v":42058,"d":"4205800.00%"},21,2,{"$nulls":6},"E",null,"S",5]
[1,{"v":42058,"d":"4205800.00%"},22,1,{"$nulls":6},"E",null,"S",5]
[1,{"v":42058,"d":"4205800.00%"},22,2,{"$nulls":6},"E",null,"S",5]
[1,{"v":42058,"d":"4205800.00%"},23,1,6310000062,null,"Gasto Impuestos locales Tienda 62",null,301.86,null,"E",null,"S",5]
[1,{"v":42058,"d":"4205800.00%"},23,2,4720002100,null,"IVA soportado Tienda 62",null,63.389999999999986,null,"E",null,"S",5]
[1,{"v":42058,"d":"4205800.00%"},23,3,5700000062,null,"Efectivo Tienda 62",null,null,365.25,"E",null,"S",5]
[1,{"v":42058,"d":"4205800.00%"},24,1,{"$nulls":6},"E",null,"S",5]
[1,{"v":42058,"d":"4205800.00%"},24,2,{"$nulls":6},"E",null,"S",5]
[1,{"v":42058,"d":"4205800.00%"},25,1,{"$nulls":6},"E",null,"S",5]
[1,{"v":42058,"d":"4205800.00%"},25,2,{"$nulls":6},"E",null,"S",5]
[1,{"v":42058,"d":"4205800.00%"},26,1,{"$nulls":6},"E",null,"S",6]
[1,{"v":42058,"d":"4205800.00%"},26,2,{"$nulls":6},"E",null,"S",6]
[1,{"v":42058,"d":"4205800.00%"},27,1,{"$nulls":6},"E",null,"S",6]
[1,{"v":42058,"d":"4205800.00%"},27,2,{"$nulls":6},"E",null,"S",6]
[1,{"v":42058,"d":"4205800.00%"},28,1,6240000063,null,"Gasto Transportes locales Tienda 63",null,217.36,null,"E",null,"S",6]
[1,{"v":42058,"d":"4205800.00%"},28,2,4720002100,null,"IVA soportado Tienda 63",null,45.639999999999986,null,"E",null,"S",6]
[1,{"v":42058,"d":"4205800.00%"},28,3,5700000063,null,"Efectivo Tienda 63",null,null,263,"E",null,"S",6]
[1,{"v":42058,"d":"4205800.00%"},29,1,{"$nulls":6},"E",null,"S",6]
[1,{"v":42058,"d":"4205800.00%"},29,2,{"$nulls":6},"E",null,"S",6]
[1,{"v":42058,"d":"4205800.00%"},30,1,{"$nulls":6},"E",null,"S",6]
[1,{"v":42058,"d":"4205800.00%"},30,2,{"$nulls":6},"E",null,"S",6]
[1,{"v":42058,"d":"4205800.00%"},31,1,{"$nulls":6},"E",null,"S",7]
[1,{"v":42058,"d":"4205800.00%"},31,2,{"$nulls":6},"E",null,"S",7]
[1,{"v":42058,"d":"4205800.00%"},32,1,{"$nulls":6},"E",null,"S",7]
[1,{"v":42058,"d":"4205800.00%"},32,2,{"$nulls":6},"E",null,"S",7]
[1,{"v":42058,"d":"4205800.00%"},33,1,6210000072,null,"Gasto Alquiler del local Tienda 72",null,520.66,null,"E",null,"S",7]
[1,{"v":42058,"d":"4205800.00%"},33,2,4720002100,null,"IVA soportado Tienda 72",null,109.34000000000003,null,"E",null,"S",7]
[1,{"v":42058,"d":"4205800.00%"},33,3,5700000072,null,"Efectivo Tienda 72",null,null,630,"E",null,"S",7]
[1,{"v":42058,"d":"4205800.00%"},34,1,{"$nulls":6},"E",null,"S",7]
[1,{"v":42058,"d":"4205800.00%"},34,2,{"$nulls":6},"E",null,"S",7]
[1,{"v":42058,"d":"4205800.00%"},35,1,{"$nulls":6},"E",null,"S",7]
[1,{"v":42058,"d":"4205800.00%"},35,2,{"$nulls":6},"E",null,"S",7]
[1,{"v":42058,"d":"4205800.00%"},36,1,4600000015,null,"Anticipo empleado 15",null,1050,null,"E",null,"S",8]
[1,{"v":42058,"d":"4205800.00%"},36,2,5700000015,null,"Efectivo empleado 15",null,null,1050,"E",null,"S",8]
[1,{"v":42058,"d":"4205800.00%"},37,1,{"$nulls":6},"E",null,"S",8]
[1,{"v":42058,"d":"4205800.00%"},37,2,{"$nulls":6},"E",null,"S",8]
[1,{"v":42058,"d":"4205800.00%"},38,1,{"$nulls":6},"E",null,"S",8]
[1,{"v":42058,"d":"4205800.00%"},38,2,{"$nulls":6},"E",null,"S",8]
[1,{"v":42058,"d":"4205800.00%"},38,3,{"$nulls":6},"E",null,"S",8]
[1,{"v":42058,"d":"4205800.00%"},39,1,{"$nulls":6},"E",null,"S",8]
[1,{"v":42058,"d":"4205800.00%"},39,2,{"$nulls":6},"E",null,"S",8]
[1,{"v":42058,"d":"4205800.00%"},40,1,{"$nulls":6},"E",null,"S",8]
[1,{"v":42058,"d":"4205800.00%"},40,2,{"$nulls":6},"E",null,"S",8]
[1,{"v":42058,"d":"4205800.00%"},41,1,{"$nulls":6},"E",null,"S",9]
[1,{"v":42058,"d":"4205800.00%"},41,2,{"$nulls":6},"E",null,"S",9]
[1,{"v":42058,"d":"4205800.00%"},42,1,5700000072,null,"Efectivo Tienda 72",null,1050,null,"E",null,"S",9]
[1,{"v":42058,"d":"4205800.00%"},42,2,4600000072,null,"Devolución Anticipo 20",null,null,1050,"E",null,"S",9]
[1,{"v":42058,"d":"4205800.00%"},43,1,{"$nulls":6},"E",null,"S",9]
[1,{"v":42058,"d":"4205800.00%"},43,2,{"$nulls":6},"E",null,"S",9]
[1,{"v":42058,"d":"4205800.00%"},43,3,{"$nulls":6},"E",null,"S",9]
[1,{"v":42058,"d":"4205800.00%"},44,1,{"$nulls":6},"E",null,"S",9]
[1,{"v":42058,"d":"4205800.00%"},44,2,{"$nulls":6},"E",null,"S",9]
[1,{"v":42058,"d":"4205800.00%"},45,1,{"$nulls":6},"E",null,"S",9]
[1,{"v":42058,"d":"4205800.00%"},45,2,{"$nulls":6},"E",null,"S",9]
[1,{"v":42058,"d":"4205800.00%"},46,1,{"$nulls":6},"E",null,"S",10]
[1,{"v":42058,"d":"4205800.00%"},46,2,{"$nulls":6},"E",null,"S",10]
[1,{"v":42058,"d":"4205800.00%"},47,1,{"$nulls":6},"E",null,"S",10]
[1,{"v":42058,"d":"4205800.00%"},47,2,{"$nulls":6},"E",null,"S",10]
[1,{"v":42058,"d":"4205800.00%"},48,1,6290000071,null,"Gasto Comunidad de propietarios Tienda 71",null,60.33,null,"E",null,"S",10]
[1,{"v":42058,"d":"4205800.00%"},48,2,4720002100,null,"IVA soportado Tienda 71",null,12.670000000000002,null,"E",null,"S",10]
[1,{"v":42058,"d":"4205800.00%"},48,3,5700000071,null,"Efectivo Tienda 71",null,null,73,"E",null,"S",10]
[1,{"v":42058,"d":"4205800.00%"},49,1,{"$nulls":6},"E",null,"S",10]
[1,{"v":42058,"d":"4205800.00%"},49,2,{"$nulls":6},"E",null,"S",10]
[1,{"v":42058,"d":"4205800.00%"},50,1,{"$nulls":6},"E",null,"S",10]
[1,{"v":42058,"d":"4205800.00%"},50,2,{"$nulls":6},"E",null,"S",10]
[1,{"v":42058,"d":"4205800.00%"},51,1,{"$nulls":6},"E",null,"S",11]
[1,{"v":42058,"d":"4205800.00%"},51,2,{"$nulls":6},"E",null,"S",11]
[1,{"v":42058,"d":"4205800.00%"},52,1,{"$nulls":6},"E",null,"S",11]
[1,{"v":42058,"d":"4205800.00%"},52,2,{"$nulls":6},"E",null,"S",11]
[1,{"v":42058,"d":"4205800.00%"},53,1,{"$nulls":6},"E",null,"S",11]
[1,{"v":42058,"d":"4205800.00%"},53,2,{"$nulls":6},"E",null,"S",11]
[1,{"v":42058,"d":"4205800.00%"},53,3,{"$nulls":6},"E",null,"S",11]
[1,{"v":42058,"d":"4205800.00%"},54,1,6590000042,null,"Otras pérdidas en gestión corriente Tienda 42",null,3.54,null,"E",null,"S",11]
[1,{"v":42058,"d":"4205800.00%"},54,2,5700000042,null,"Efectivo Tienda 42",null,null,3.54,"E",null,"S",11]
[1,{"v":42058,"d":"4205800.00%"},55,1,{"$nulls":6},"E",null,"S",11]
[1,{"v":42058,"d":"4205800.00%"},55,2,{"$nulls":6},"E",null,"S",11]
[1,{"v":42058,"d":"4205800.00%"},56,1,{"$nulls":6},"E",null,"S",12]
[1,{"v":42058,"d":"4205800.00%"},56,2,{"$nulls":6},"E",null,"S",12]
[1,{"v":42058,"d":"4205800.00%"},57,1,{"$nulls":6},"E",null,"S",12]
[1,{"v":42058,"d":"4205800.00%"},57,2,{"$nulls":6},"E",null,"S",12]
[1,{"v":42058,"d":"4205800.00%"},58,1,6220000032,null,"Gasto Mantenimiento inmovilizado Tienda 32",null,121.74,null,"E",null,"S",12]
[1,{"v":42058,"d":"4205800.00%"},58,2,4720002100,null,"IVA soportado Tienda 32",null,25.560000000000016,null,"E",null,"S",12]
[1,{"v":42058,"d":"4205800.00%"},58,3,5700000032,null,"Efectivo Tienda 32",null,null,147.3,"E",null,"S",12]
[1,{"v":42058,"d":"4205800.00%"},59,1,{"$nulls":6},"E",null,"S",12]
[1,{"v":42058,"d":"4205800.00%"},59,2,{"$nulls":6},"E",null,"S",12]
[1,{"v":42058,"d":"4205800.00%"},60,1,{"$nulls":6},"E",null,"S",12]
[1,{"v":42058,"d":"4205800.00%"},60,2,{"$nulls":6},"E",null,"S",12]

{"sheet":"Nóminas","index":24,"n_rows":22,"n_cols":14,"rows_kept":22}
["Id Empleado","Nombre","Sueldo ","Cta. Salario","Cta.Dietas","Cta. IRPF","Cta. S. Social","Cta.Gasto S.S Empr.","Cta. Remun. Pte","Cta. Anticipo ","Cta. Banco","Id Sindicato","Cta. Sindicato","Id Tienda"]
[1,"Del Río Celorio Carlos",1050,{"$f":"\"640000\"&N2&TEXT(A2,\"00\")","v":"6400001501"},{"$f":"\"629000\"&N2&TEXT(A2,\"00\")","v":"6290001501"},{"$f":"\"475100\"&N2&TEXT(A2,\"00\")","v":"4751001501"},{"$f":"\"476000\"&N2&TEXT(A2,\"00\")","v":"4760001501"},{"$f":"\"642000\"&N2&TEXT(A2,\"00\")","v":"6420001501"},{"$f":"\"465000\"&TEXT(N2,\"00\")&TEXT(A2,\"00\")","v":"4650001501"},{"$f":"\"460000\"&N2&TEXT(A2,\"00\")","v":"4600001501"},{"$f":"VLOOKUP(N2,Tabla6[[Id Tienda]:[Cta. Banco Efectivo]],10)","v":"5720010002"},null,{"$f":"IF(L2=\"\",\"\",VLOOKUP(L2,Tabla18[],4)&Nóminas!N2&TEXT(Nóminas!A2,\"00\"))","v":""},15]
[2,"Deus Bouzas Beatriz",1050,"6400003202","6290003202","4751003202","4760003202","6420003202","4650003202","4600003202",{"$f":"VLOOKUP(N3,Tabla6[[Id Tienda]:[Cta. Banco Efectivo]],10)","v":"5720010001"},2,{"$f":"IF(L3=\"\",\"\",VLOOKUP(L3,Tabla18[],4)&Nóminas!N3&TEXT(Nóminas!A3,\"00\"))","v":"4120023202"},32]
[3,"Devesa Neira Maria Ester",1050,"6400003203","6290003203","4751003203","4760003203","6420003203","4650003203","4600003203",{"$f":"VLOOKUP(N4,Tabla6[[Id Tienda]:[Cta. Banco Efectivo]],10)","v":"5720010001"},null,{"$f":"IF(L4=\"\",\"\",VLOOKUP(L4,Tabla18[],4)&Nóminas!N4&TEXT(Nóminas!A4,\"00\"))","v":""},32]
[4,"Diaz Castro Daniel",1050,"6400003304","6290003304","4751003304","4760003304","6420003304","4650003304","4600003304",{"$f":"VLOOKUP(N5,Tabla6[[Id Tienda]:[Cta. Banco Efectivo]],10)","v":"5720010001"},null,{"$f":"IF(L5=\"\",\"\",VLOOKUP(L5,Tabla18[],4)&Nóminas!N5&TEXT(Nóminas!A5,\"00\"))","v":""},33]
[5,"Diaz Diaz De Labra Manuel",1050,"6400004405","6290004405","4751004405","4760004405","6420004405","4650004405","4600004405",{"$f":"VLOOKUP(N6,Tabla6[[Id Tienda]:[Cta. Banco Efectivo]],10)","v":"5720010003"},null,{"$f":"IF(L6=\"\",\"\",VLOOKUP(L6,Tabla18[],4)&Nóminas!N6&TEXT(Nóminas!A6,\"00\"))","v":""},44]
[6,"Díaz Gómez Hilda",1050,"6400005306","6290005306","4751005306","4760005306","6420005306","4650005306","4600005306",{"$f":"VLOOKUP(N7,Tabla6[[Id Tienda]:[Cta. Banco Efectivo]],10)","v":"5720010002"},2,{"$f":"IF(L7=\"\",\"\",VLOOKUP(L7,Tabla18[],4)&Nóminas!N7&TEXT(Nóminas!A7,\"00\"))","v":"4120025306"},53]
[7,"Diaz Gonzalez Guadalupe",1050,"6400005407","6290005407","4751005407","4760005407","6420005407","4650005407","4600005407",{"$f":"VLOOKUP(N8,Tabla6[[Id Tienda]:[Cta. Banco Efectivo]],10)","v":"5720010005"},null,{"$f":"IF(L8=\"\",\"\",VLOOKUP(L8,Tabla18[],4)&Nóminas!N8&TEXT(Nóminas!A8,\"00\"))","v":""},54]
[8,"Díaz Modroño Carlos",1050,"6400006208","6290006208","4751006208","4760006208","6420006208","4650006208","4600006208",{"$f":"VLOOKUP(N9,Tabla6[[Id Tienda]:[Cta. Banco Efectivo]],10)","v":"5720010006"},null,{"$f":"IF(L9=\"\",\"\",VLOOKUP(L9,Tabla18[],4)&Nóminas!N9&TEXT(Nóminas!A9,\"00\"))","v":""},62]
[9,"Diéguez González Rubén",1050,"6400006109","6290006109","4751006109","4760006109","6420006109","4650006109","4600006109",{"$f":"VLOOKUP(N10,Tabla6[[Id Tienda]:[Cta. Banco Efectivo]],10)","v":"5720010006"},1,{"$f":"IF(L10=\"\",\"\",VLOOKUP(L10,Tabla18[],4)&Nóminas!N10&TEXT(Nóminas!A10,\"00\"))","v":"4120016109"},61]
[10,"Domínguez Domínguez Noelia",1050,"6400006310","6290006310","4751006310","4760006310","6420006310","4650006310","4600006310",{"$f":"VLOOKUP(N11,Tabla6[[Id Tienda]:[Cta. Banco Efectivo]],10)","v":"5720010006"},2,{"$f":"IF(L11=\"\",\"\",VLOOKUP(L11,Tabla18[],4)&Nóminas!N11&TEXT(Nóminas!A11,\"00\"))","v":"4120026310"},63]
[11,"Domínguez Froján Pablo",1050,"6400001111","6290001111","4751001111","4760001111","6420001111","4650001111","4600001111",{"$f":"VLOOKUP(N12,Tabla6[[Id Tienda]:[Cta. Banco Efectivo]],10)","v":"5720010003"},null,{"$f":"IF(L12=\"\",\"\",VLOOKUP(L12,Tabla18[],4)&Nóminas!N12&TEXT(Nóminas!A12,\"00\"))","v":""},11]
[12,"Domínguez Ribes Borja",1050,"6400004212","6290004212","4751004212","4760004212","6420004212","4650004212","4600004212",{"$f":"VLOOKUP(N13,Tabla6[[Id Tienda]:[Cta. Banco Efectivo]],10)","v":"5720010003"},null,{"$f":"IF(L13=\"\",\"\",VLOOKUP(L13,Tabla18[],4)&Nóminas!N13&TEXT(Nóminas!A13,\"00\"))","v":""},42]
[13,"Domínguez Soutullo Raquel",1050,"6400001113","6290001113","4751001113","4760001113","6420001113","4650001113","4600001113",{"$f":"VLOOKUP(N14,Tabla6[[Id Tienda]:[Cta. Banco Efectivo]],10)","v":"5720010003"},null,{"$f":"IF(L14=\"\",\"\",VLOOKUP(L14,Tabla18[],4)&Nóminas!N14&TEXT(Nóminas!A14,\"00\"))","v":""},11]
[14,"Domínguez Vigo Cristina",1050,"6400004214","6290004214","4751004214","4760004214","6420004214","4650004214","4600004214",{"$f":"VLOOKUP(N15,Tabla6[[Id Tienda]:[Cta. Banco Efectivo]],10)","v":"5720010003"},null,{"$f":"IF(L15=\"\",\"\",VLOOKUP(L15,Tabla18[],4)&Nóminas!N15&TEXT(Nóminas!A15,\"00\"))","v":""},42]
[15,"Dopereiro García Alba",1050,"6400007115","6290007115","4751007115","4760007115","6420007115","4650007115","4600007115",{"$f":"VLOOKUP(N16,Tabla6[[Id Tienda]:[Cta. Banco Efectivo]],10)","v":"5720010004"},null,{"$f":"IF(L16=\"\",\"\",VLOOKUP(L16,Tabla18[],4)&Nóminas!N16&TEXT(Nóminas!A16,\"00\"))","v":""},71]
[16,"Dopico Diaz Pedro",1050,"6400007216","6290007216","4751007216","4760007216","6420007216","4650007216","4600007216",{"$f":"VLOOKUP(N17,Tabla6[[Id Tienda]:[Cta. Banco Efectivo]],10)","v":"5720010004"},1,{"$f":"IF(L17=\"\",\"\",VLOOKUP(L17,Tabla18[],4)&Nóminas!N17&TEXT(Nóminas!A17,\"00\"))","v":"4120017216"},72]
[17,"Dopico Saavedra Paula",1050,"6400007217","6290007217","4751007217","4760007217","6420007217","4650007217","4600007217",{"$f":"VLOOKUP(N18,Tabla6[[Id Tienda]:[Cta. Banco Efectivo]],10)","v":"5720010004"},null,{"$f":"IF(L18=\"\",\"\",VLOOKUP(L18,Tabla18[],4)&Nóminas!N18&TEXT(Nóminas!A18,\"00\"))","v":""},72]
[18,"Dorribo Martínez Tomás",1050,"6400004418","6290004418","4751004418","4760004418","6420004418","4650004418","4600004418",{"$f":"VLOOKUP(N19,Tabla6[[Id Tienda]:[Cta. Banco Efectivo]],10)","v":"5720010003"},null,{"$f":"IF(L19=\"\",\"\",VLOOKUP(L19,Tabla18[],4)&Nóminas!N19&TEXT(Nóminas!A19,\"00\"))","v":""},44]
[19,"Dozo Duarte María",1050,"6400005319","6290005319","4751005319","4760005319","6420005319","4650005319","4600005319",{"$f":"VLOOKUP(N20,Tabla6[[Id Tienda]:[Cta. Banco Efectivo]],10)","v":"5720010002"},null,{"$f":"IF(L20=\"\",\"\",VLOOKUP(L20,Tabla18[],4)&Nóminas!N20&TEXT(Nóminas!A20,\"00\"))","v":""},53]
[20,"Duran Casares Alvaro",1050,"6400006120","6290006120","4751006120","4760006120","6420006120","4650006120","4600006120",{"$f":"VLOOKUP(N21,Tabla6[[Id Tienda]:[Cta. Banco Efectivo]],10)","v":"5720010006"},null,{"$f":"IF(L21=\"\",\"\",VLOOKUP(L21,Tabla18[],4)&Nóminas!N21&TEXT(Nóminas!A21,\"00\"))","v":""},61]
[21,"Duran Luaces Nuria",1050,"6400001521","6290001521","4751001521","4760001521","6420001521","4650001521","4600001521",{"$f":"VLOOKUP(N22,Tabla6[[Id Tienda]:[Cta. Banco Efectivo]],10)","v":"5720010002"},null,{"$f":"IF(L22=\"\",\"\",VLOOKUP(L22,Tabla18[],4)&Nóminas!N22&TEXT(Nóminas!A22,\"00\"))","v":""},15]

{"sheet":"Sindicatos","index":25,"n_rows":3,"n_cols":4,"rows_kept":3}
["Id Sindicato","Nombre","Cuota sindicato","Cuenta Acreedora"]
[1,"CCOO",52.5,{"$f":"\"41200\"&Tabla18[[#This Row],[Id Sindicato]]","v":"412001"}]
[2,"UGT",84,{"$f":"\"41200\"&Tabla18[[#This Row],[Id Sindicato]]","v":"412002"}]

{"sheet":"ContabilizaciónNómina","index":26,"n_rows":13,"n_cols":33,"rows_kept":13}
["Fecha","Id Empleado","Salario","Dietas","Retención IRPF","S.Social Trabajador","S.Social Empresa","Anticipo","Cuota Sind.","Id Sindicato","Cta. Salario","Cta. IRPF","Cta. S. Social","Cta. Dieta","Cta. Anticipo","Cta. Sindicato","Cta. Remun. Pte","Cta. Banco","Cta Gasto. SS Empresa","Remune. Pte","Remu. Pte. Pago nómina","Pago retenciones Hacienda","Conc. Salarios","Conc. IRPF","Conc. S.Social","Conc. Anticipo","Conc. Sindicato","Conc. Remun. Ptes","Conc. Dietas","Id Tienda","Conc. Banco","Conc. SS Empresa","Moneda"]
["31/04/2015",5,{"$f":"VLOOKUP(Tabla20[[#This Row],[Id Empleado]],Nóminas!$A$2:$C$22,3)","v":1050},0,245.28,66.68,315,600,0,"",{"$f":"VLOOKUP(Tabla20[[#This Row],[Id Empleado]],Nóminas!$A$2:$D$22,4)","v":"6400004405"},{"$f":"VLOOKUP(B2,Nóminas!$A$1:$F$22,6)","v":"4751004405"},{"$f":"VLOOKUP(Tabla20[[#This Row],[Id Empleado]],Nóminas!$A$2:$G$22,7)","v":"4760004405"},{"$f":"VLOOKUP(Tabla20[[#This Row],[Id Empleado]],Nóminas!$A$2:$E$22,5)","v":"6290004405"},{"$f":"VLOOKUP(Tabla20[[#This Row],[Id Empleado]],Nóminas!$A$2:$J$22,10)","v":"4600004405"},{"$f":"VLOOKUP(Tabla20[[#This Row],[Id Empleado]],Nóminas!$A$2:$M$22,13)","v":""},{"$f":"VLOOKUP(Tabla20[[#This Row],[Id Empleado]],Nóminas!$A$1:$I$22,9)","v":"4650004405"},{"$f":"VLOOKUP(Tabla20[[#This Row],[Id Empleado]],Nóminas!$A$2:$K$22,11)","v":"5720010003"},{"$f":"VLOOKUP(Tabla20[[#This Row],[Id Empleado]],Nóminas!$A$2:$H$22,8)","v":"6420004405"},{"$f":"ROUND(Tabla20[[#This Row],[Salario]]-Tabla20[[#This Row],[Retención IRPF]]-Tabla20[[#This Row],[S.Social Trabajador]]-Tabla20[[#This Row],[Anticipo]]-Tabla20[[#This Row],[Cuota Sind.]],2)","v":138.04},{"$f":"ROUND(T2+Tabla20[[#This Row],[Dietas]],2)","v":138.04},{"$f":"ROUND(Tabla20[[#This Row],[Retención IRPF]]+Tabla20[[#This Row],[S.Social Trabajador]]+Tabla20[[#This Row],[S.Social Empresa]]+Tabla20[[#This Row],[Cuota Sind.]],2)","v":626.96},{"$f":"\"Sueldos y salarios \"&B2","v":"Sueldos y salarios 5"},{"$f":"\"H.P acreedora por retenciones practicadas \"&B2","v":"H.P acreedora por retenciones practicadas 5"},{"$f":"\"Org. SS, acreedores \"&B2","v":"Org. SS, acreedores 5"},{"$f":"\"Anticipo de renumeraciones \"&B2","v":"Anticipo de renumeraciones 5"},{"$f":"\"Cuota sindicato \"&B2","v":"Cuota sindicato 5"},{"$f":"\"Renumeraciones ptes de pago \"&B2","v":"Renumeraciones ptes de pago 5"},{"$f":"\"Dietas \"&B2","v":"Dietas 5"},{"$f":"MID(S2,7,2)","v":"44"},{"$f":"\"Bancos Tienda \"&AD2","v":"Bancos Tienda 44"},{"$f":"\"S.S empresa empleado \"&B2","v":"S.S empresa empleado 5"},"E"]
["31/04/2015",6,{"$f":"VLOOKUP(Tabla20[[#This Row],[Id Empleado]],Nóminas!$A$2:$C$22,3)","v":1050},18.3,225.96,66.68,315,0,84,2,{"$f":"VLOOKUP(Tabla20[[#This Row],[Id Empleado]],Nóminas!$A$2:$D$22,4)","v":"6400005306"},{"$f":"VLOOKUP(B3,Nóminas!$A$1:$F$22,6)","v":"4751005306"},{"$f":"VLOOKUP(Tabla20[[#This Row],[Id Empleado]],Nóminas!$A$2:$G$22,7)","v":"4760005306"},{"$f":"VLOOKUP(Tabla20[[#This Row],[Id Empleado]],Nóminas!$A$2:$E$22,5)","v":"6290005306"},{"$f":"VLOOKUP(Tabla20[[#This Row],[Id Empleado]],Nóminas!$A$2:$J$22,10)","v":"4600005306"},{"$f":"VLOOKUP(Tabla20[[#This Row],[Id Empleado]],Nóminas!$A$2:$M$22,13)","v":"4120025306"},{"$f":"VLOOKUP(Tabla20[[#This Row],[Id Empleado]],Nóminas!$A$1:$I$22,9)","v":"4650005306"},{"$f":"VLOOKUP(Tabla20[[#This Row],[Id Empleado]],Nóminas!$A$2:$K$22,11)","v":"5720010002"},{"$f":"VLOOKUP(Tabla20[[#This Row],[Id Empleado]],Nóminas!$A$2:$H$22,8)","v":"6420005306"},{"$f":"ROUND(Tabla20[[#This Row],[Salario]]-Tabla20[[#This Row],[Retención IRPF]]-Tabla20[[#This Row],[S.Social Trabajador]]-Tabla20[[#This Row],[Anticipo]]-Tabla20[[#This Row],[Cuota Sind.]],2)","v":673.36},{"$f":"ROUND(T3+Tabla20[[#This Row],[Dietas]],2)","v":691.66},{"$f":"ROUND(Tabla20[[#This Row],[Retención IRPF]]+Tabla20[[#This Row],[S.Social Trabajador]]+Tabla20[[#This Row],[S.Social Empresa]]+Tabla20[[#This Row],[Cuota Sind.]],2)","v":691.64},{"$f":"\"Sueldos y salarios \"&B3","v":"Sueldos y salarios 6"},{"$f":"\"H.P acreedora por retenciones practicadas \"&B3","v":"H.P acreedora por retenciones practicadas 6"},{"$f":"\"Org. SS, acreedores \"&B3","v":"Org. SS, acreedores 6"},{"$f":"\"Anticipo de renumeraciones \"&B3","v":"Anticipo de renumeraciones 6"},{"$f":"\"Cuota sindicato \"&B3","v":"Cuota sindicato 6"},{"$f":"\"Renumeraciones ptes de pago \"&B3","v":"Renumeraciones ptes de pago 6"},{"$f":"\"Dietas \"&B3","v":"Dietas 6"},{"$f":"MID(S3,7,2)","v":"53"},{"$f":"\"Bancos Tienda \"&AD3","v":"Bancos Tienda 53"},{"$f":"\"S.S empresa empleado \"&B3","v":"S.S empresa empleado 6"},"E"]
["31/04/2015",7,{"$f":"VLOOKUP(Tabla20[[#This Row],[Id Empleado]],Nóminas!$A$2:$C$22,3)","v":1050},0,232.47,66.68,315,300,0,"",{"$f":"VLOOKUP(Tabla20[[#This Row],[Id Empleado]],Nóminas!$A$2:$D$22,4)","v":"6400005407"},{"$f":"VLOOKUP(B4,Nóminas!$A$1:$F$22,6)","v":"4751005407"},{"$f":"VLOOKUP(Tabla20[[#This Row],[Id Empleado]],Nóminas!$A$2:$G$22,7)","v":"4760005407"},{"$f":"VLOOKUP(Tabla20[[#This Row],[Id Empleado]],Nóminas!$A$2:$E$22,5)","v":"6290005407"},{"$f":"VLOOKUP(Tabla20[[#This Row],[Id Empleado]],Nóminas!$A$2:$J$22,10)","v":"4600005407"},{"$f":"VLOOKUP(Tabla20[[#This Row],[Id Empleado]],Nóminas!$A$2:$M$22,13)","v":""},{"$f":"VLOOKUP(Tabla20[[#This Row],[Id Empleado]],Nóminas!$A$1:$I$22,9)","v":"4650005407"},{"$f":"VLOOKUP(Tabla20[[#This Row],[Id Empleado]],Nóminas!$A$2:$K$22,11)","v":"5720010005"},{"$f":"VLOOKUP(Tabla20[[#This Row],[Id Empleado]],Nóminas!$A$2:$H$22,8)","v":"6420005407"},{"$f":"ROUND(Tabla20[[#This Row],[Salario]]-Tabla20[[#This Row],[Retención IRPF]]-Tabla20[[#This Row],[S.Social Trabajador]]-Tabla20[[#This Row],[Anticipo]]-Tabla20[[#This Row],[Cuota Sind.]],2)","v":450.85},{"$f":"ROUND(T4+Tabla20[[#This Row],[Dietas]],2)","v":450.85},{"$f":"ROUND(Tabla20[[#This Row],[Retención IRPF]]+Tabla20[[#This Row],[S.Social Trabajador]]+Tabla20[[#This Row],[S.Social Empresa]]+Tabla20[[#This Row],[Cuota Sind.]],2)","v":614.15},"Sueldos y salarios 7","H.P acreedora por retenciones practicadas 7","Org. SS, acreedores 7","Anticipo de renumeraciones 7","Cuota sindicato 7","Renumeraciones ptes de pago 7","Dietas 7","54","Bancos Tienda 54","S.S empresa empleado 7","E"]
["31/04/2015",8,{"$f":"VLOOKUP(Tabla20[[#This Row],[Id Empleado]],Nóminas!$A$2:$C$22,3)","v":1050},0,232.79,66.68,315,0,0,"",{"$f":"VLOOKUP(Tabla20[[#This Row],[Id Empleado]],Nóminas!$A$2:$D$22,4)","v":"6400006208"},{"$f":"VLOOKUP(B5,Nóminas!$A$1:$F$22,6)","v":"4751006208"},{"$f":"VLOOKUP(Tabla20[[#This Row],[Id Empleado]],Nóminas!$A$2:$G$22,7)","v":"4760006208"},{"$f":"VLOOKUP(Tabla20[[#This Row],[Id Empleado]],Nóminas!$A$2:$E$22,5)","v":"6290006208"},{"$f":"VLOOKUP(Tabla20[[#This Row],[Id Empleado]],Nóminas!$A$2:$J$22,10)","v":"4600006208"},{"$f":"VLOOKUP(Tabla20[[#This Row],[Id Empleado]],Nóminas!$A$2:$M$22,13)","v":""},{"$f":"VLOOKUP(Tabla20[[#This Row],[Id Empleado]],Nóminas!$A$1:$I$22,9)","v":"4650006208"},{"$f":"VLOOKUP(Tabla20[[#This Row],[Id Empleado]],Nóminas!$A$2:$K$22,11)","v":"5720010006"},{"$f":"VLOOKUP(Tabla20[[#This Row],[Id Empleado]],Nóminas!$A$2:$H$22,8)","v":"6420006208"},{"$f":"ROUND(Tabla20[[#This Row],[Salario]]-Tabla20[[#This Row],[Retención IRPF]]-Tabla20[[#This Row],[S.Social Trabajador]]-Tabla20[[#This Row],[Anticipo]]-Tabla20[[#This Row],[Cuota Sind.]],2)","v":750.53},{"$f":"ROUND(T5+Tabla20[[#This Row],[Dietas]],2)","v":750.53},{"$f":"ROUND(Tabla20[[#This Row],[Retención IRPF]]+Tabla20[[#This Row],[S.Social Trabajador]]+Tabla20[[#This Row],[S.Social Empresa]]+Tabla20[[#This Row],[Cuota Sind.]],2)","v":614.47},"Sueldos y salarios 8","H.P acreedora por retenciones practicadas 8","Org. SS, acreedores 8","Anticipo de renumeraciones 8","Cuota sindicato 8","Renumeraciones ptes de pago 8","Dietas 8","62","Bancos Tienda 62","S.S empresa empleado 8","E"]
["31/04/2015",9,{"$f":"VLOOKUP(Tabla20[[#This Row],[Id Empleado]],Nóminas!$A$2:$C$22,3)","v":1050},0,242.97,66.68,315,0,52.5,1,{"$f":"VLOOKUP(Tabla20[[#This Row],[Id Empleado]],Nóminas!$A$2:$D$22,4)","v":"6400006109"},{"$f":"VLOOKUP(B6,Nóminas!$A$1:$F$22,6)","v":"4751006109"},{"$f":"VLOOKUP(Tabla20[[#This Row],[Id Empleado]],Nóminas!$A$2:$G$22,7)","v":"4760006109"},{"$f":"VLOOKUP(Tabla20[[#This Row],[Id Empleado]],Nóminas!$A$2:$E$22,5)","v":"6290006109"},{"$f":"VLOOKUP(Tabla20[[#This Row],[Id Empleado]],Nóminas!$A$2:$J$22,10)","v":"4600006109"},{"$f":"VLOOKUP(Tabla20[[#This Row],[Id Empleado]],Nóminas!$A$2:$M$22,13)","v":"4120016109"},{"$f":"VLOOKUP(Tabla20[[#This Row],[Id Empleado]],Nóminas!$A$1:$I$22,9)","v":"4650006109"},{"$f":"VLOOKUP(Tabla20[[#This Row],[Id Empleado]],Nóminas!$A$2:$K$22,11)","v":"5720010006"},{"$f":"VLOOKUP(Tabla20[[#This Row],[Id Empleado]],Nóminas!$A$2:$H$22,8)","v":"6420006109"},{"$f":"ROUND(Tabla20[[#This Row],[Salario]]-Tabla20[[#This Row],[Retención IRPF]]-Tabla20[[#This Row],[S.Social Trabajador]]-Tabla20[[#This Row],[Anticipo]]-Tabla20[[#This Row],[Cuota Sind.]],2)","v":687.85},{"$f":"ROUND(T6+Tabla20[[#This Row],[Dietas]],2)","v":687.85},{"$f":"ROUND(Tabla20[[#This Row],[Retención IRPF]]+Tabla20[[#This Row],[S.Social Trabajador]]+Tabla20[[#This Row],[S.Social Empresa]]+Tabla20[[#This Row],[Cuota Sind.]],2)","v":677.15},"Sueldos y salarios 9","H.P acreedora por retenciones practicadas 9","Org. SS, acreedores 9","Anticipo de renumeraciones 9","Cuota sindicato 9","Renumeraciones ptes de pago 9","Dietas 9","61","Bancos Tienda 61","S.S empresa empleado 9","E"]
["31/04/2015",10,{"$f":"VLOOKUP(Tabla20[[#This Row],[Id Empleado]],Nóminas!$A$2:$C$22,3)","v":1050},21.56,208.43,66.68,315,0,84,2,{"$f":"VLOOKUP(Tabla20[[#This Row],[Id Empleado]],Nóminas!$A$2:$D$22,4)","v":"6400006310"},{"$f":"VLOOKUP(B7,Nóminas!$A$1:$F$22,6)","v":"4751006310"},{"$f":"VLOOKUP(Tabla20[[#This Row],[Id Empleado]],Nóminas!$A$2:$G$22,7)","v":"4760006310"},{"$f":"VLOOKUP(Tabla20[[#This Row],[Id Empleado]],Nóminas!$A$2:$E$22,5)","v":"6290006310"},{"$f":"VLOOKUP(Tabla20[[#This Row],[Id Empleado]],Nóminas!$A$2:$J$22,10)","v":"4600006310"},{"$f":"VLOOKUP(Tabla20[[#This Row],[Id Empleado]],Nóminas!$A$2:$M$22,13)","v":"4120026310"},{"$f":"VLOOKUP(Tabla20[[#This Row],[Id Empleado]],Nóminas!$A$1:$I$22,9)","v":"4650006310"},{"$f":"VLOOKUP(Tabla20[[#This Row],[Id Empleado]],Nóminas!$A$2:$K$22,11)","v":"5720010006"},{"$f":"VLOOKUP(Tabla20[[#This Row],[Id Empleado]],Nóminas!$A$2:$H$22,8)","v":"6420006310"},{"$f":"ROUND(Tabla20[[#This Row],[Salario]]-Tabla20[[#This Row],[Retención IRPF]]-Tabla20[[#This Row],[S.Social Trabajador]]-Tabla20[[#This Row],[Anticipo]]-Tabla20[[#This Row],[Cuota Sind.]],2)","v":690.89},{"$f":"ROUND(T7+Tabla20[[#This Row],[Dietas]],2)","v":712.45},{"$f":"ROUND(Tabla20[[#This Row],[Retención IRPF]]+Tabla20[[#This Row],[S.Social Trabajador]]+Tabla20[[#This Row],[S.Social Empresa]]+Tabla20[[#This Row],[Cuota Sind.]],2)","v":674.11},"Sueldos y salarios 10","H.P acreedora por retenciones practicadas 10","Org. SS, acreedores 10","Anticipo de renumeraciones 10","Cuota sindicato 10","Renumeraciones ptes de pago 10","Dietas 10","63","Bancos Tienda 63","S.S empresa empleado 10","E"]
["31/04/2015",11,{"$f":"VLOOKUP(Tabla20[[#This Row],[Id Empleado]],Nóminas!$A$2:$C$22,3)","v":1050},0,243.08,66.68,315,0,0,"",{"$f":"VLOOKUP(Tabla20[[#This Row],[Id Empleado]],Nóminas!$A$2:$D$22,4)","v":"6400001111"},{"$f":"VLOOKUP(B8,Nóminas!$A$1:$F$22,6)","v":"4751001111"},{"$f":"VLOOKUP(Tabla20[[#This Row],[Id Empleado]],Nóminas!$A$2:$G$22,7)","v":"4760001111"},{"$f":"VLOOKUP(Tabla20[[#This Row],[Id Empleado]],Nóminas!$A$2:$E$22,5)","v":"6290001111"},{"$f":"VLOOKUP(Tabla20[[#This Row],[Id Empleado]],Nóminas!$A$2:$J$22,10)","v":"4600001111"},{"$f":"VLOOKUP(Tabla20[[#This Row],[Id Empleado]],Nóminas!$A$2:$M$22,13)","v":""},{"$f":"VLOOKUP(Tabla20[[#This Row],[Id Empleado]],Nóminas!$A$1:$I$22,9)","v":"4650001111"},{"$f":"VLOOKUP(Tabla20[[#This Row],[Id Empleado]],Nóminas!$A$2:$K$22,11)","v":"5720010003"},{"$f":"VLOOKUP(Tabla20[[#This Row],[Id Empleado]],Nóminas!$A$2:$H$22,8)","v":"6420001111"},{"$f":"ROUND(Tabla20[[#This Row],[Salario]]-Tabla20[[#This Row],[Retención IRPF]]-Tabla20[[#This Row],[S.Social Trabajador]]-Tabla20[[#This Row],[Anticipo]]-Tabla20[[#This Row],[Cuota Sind.]],2)","v":740.24},{"$f":"ROUND(T8+Tabla20[[#This Row],[Dietas]],2)","v":740.24},{"$f":"ROUND(Tabla20[[#This Row],[Retención IRPF]]+Tabla20[[#This Row],[S.Social Trabajador]]+Tabla20[[#This Row],[S.Social Empresa]]+Tabla20[[#This Row],[Cuota Sind.]],2)","v":624.76},"Sueldos y salarios 11","H.P acreedora por retenciones practicadas 11","Org. SS, acreedores 11","Anticipo de renumeraciones 11","Cuota sindicato 11","Renumeraciones ptes de pago 11","Dietas 11","11","Bancos Tienda 11","S.S empresa empleado 11","E"]
["31/04/2015",2,{"$f":"VLOOKUP(Tabla20[[#This Row],[Id Empleado]],Nóminas!$A$2:$C$22,3)","v":1050},0,210,66.68,315,0,84,2,{"$f":"VLOOKUP(Tabla20[[#This Row],[Id Empleado]],Nóminas!$A$2:$D$22,4)","v":"6400003202"},{"$f":"VLOOKUP(B9,Nóminas!$A$1:$F$22,6)","v":"4751003202"},{"$f":"VLOOKUP(Tabla20[[#This Row],[Id Empleado]],Nóminas!$A$2:$G$22,7)","v":"4760003202"},{"$f":"VLOOKUP(Tabla20[[#This Row],[Id Empleado]],Nóminas!$A$2:$E$22,5)","v":"6290003202"},{"$f":"VLOOKUP(Tabla20[[#This Row],[Id Empleado]],Nóminas!$A$2:$J$22,10)","v":"4600003202"},{"$f":"VLOOKUP(Tabla20[[#This Row],[Id Empleado]],Nóminas!$A$2:$M$22,13)","v":"4120023202"},{"$f":"VLOOKUP(Tabla20[[#This Row],[Id Empleado]],Nóminas!$A$1:$I$22,9)","v":"4650003202"},{"$f":"VLOOKUP(Tabla20[[#This Row],[Id Empleado]],Nóminas!$A$2:$K$22,11)","v":"5720010001"},{"$f":"VLOOKUP(Tabla20[[#This Row],[Id Empleado]],Nóminas!$A$2:$H$22,8)","v":"6420003202"},{"$f":"ROUND(Tabla20[[#This Row],[Salario]]-Tabla20[[#This Row],[Retención IRPF]]-Tabla20[[#This Row],[S.Social Trabajador]]-Tabla20[[#This Row],[Anticipo]]-Tabla20[[#This Row],[Cuota Sind.]],2)","v":689.32},{"$f":"ROUND(T9+Tabla20[[#This Row],[Dietas]],2)","v":689.32},{"$f":"ROUND(Tabla20[[#This Row],[Retención IRPF]]+Tabla20[[#This Row],[S.Social Trabajador]]+Tabla20[[#This Row],[S.Social Empresa]]+Tabla20[[#This Row],[Cuota Sind.]],2)","v":675.68},"Sueldos y salarios 2","H.P acreedora por retenciones practicadas 2","Org. SS, acreedores 2","Anticipo de renumeraciones 2","Cuota sindicato 2","Renumeraciones ptes de pago 2","Dietas 2","32","Bancos Tienda 32","S.S empresa empleado 2","E"]
["31/04/2015",13,{"$f":"VLOOKUP(Tabla20[[#This Row],[Id Empleado]],Nóminas!$A$2:$C$22,3)","v":1050},0,225.44,66.68,315,450,0,"",{"$f":"VLOOKUP(Tabla20[[#This Row],[Id Empleado]],Nóminas!$A$2:$D$22,4)","v":"6400001113"},{"$f":"VLOOKUP(B10,Nóminas!$A$1:$F$22,6)","v":"4751001113"},{"$f":"VLOOKUP(Tabla20[[#This Row],[Id Empleado]],Nóminas!$A$2:$G$22,7)","v":"4760001113"},{"$f":"VLOOKUP(Tabla20[[#This Row],[Id Empleado]],Nóminas!$A$2:$E$22,5)","v":"6290001113"},{"$f":"VLOOKUP(Tabla20[[#This Row],[Id Empleado]],Nóminas!$A$2:$J$22,10)","v":"4600001113"},{"$f":"VLOOKUP(Tabla20[[#This Row],[Id Empleado]],Nóminas!$A$2:$M$22,13)","v":""},{"$f":"VLOOKUP(Tabla20[[#This Row],[Id Empleado]],Nóminas!$A$1:$I$22,9)","v":"4650001113"},{"$f":"VLOOKUP(Tabla20[[#This Row],[Id Empleado]],Nóminas!$A$2:$K$22,11)","v":"5720010003"},{"$f":"VLOOKUP(Tabla20[[#This Row],[Id Empleado]],Nóminas!$A$2:$H$22,8)","v":"6420001113"},{"$f":"ROUND(Tabla20[[#This Row],[Salario]]-Tabla20[[#This Row],[Retención IRPF]]-Tabla20[[#This Row],[S.Social Trabajador]]-Tabla20[[#This Row],[Anticipo]]-Tabla20[[#This Row],[Cuota Sind.]],2)","v":307.88},{"$f":"ROUND(T10+Tabla20[[#This Row],[Dietas]],2)","v":307.88},{"$f":"ROUND(Tabla20[[#This Row],[Retención IRPF]]+Tabla20[[#This Row],[S.Social Trabajador]]+Tabla20[[#This Row],[S.Social Empresa]]+Tabla20[[#This Row],[Cuota Sind.]],2)","v":607.12},"Sueldos y salarios 13","H.P acreedora por retenciones practicadas 13","Org. SS, acreedores 13","Anticipo de renumeraciones 13","Cuota sindicato 13","Renumeraciones ptes de pago 13","Dietas 13","11","Bancos Tienda 11","S.S empresa empleado 13","E"]
["31/04/2015",14,{"$f":"VLOOKUP(Tabla20[[#This Row],[Id Empleado]],Nóminas!$A$2:$C$22,3)","v":1050},0,210.32,66.68,315,0,0,"",{"$f":"VLOOKUP(Tabla20[[#This Row],[Id Empleado]],Nóminas!$A$2:$D$22,4)","v":"6400004214"},{"$f":"VLOOKUP(B11,Nóminas!$A$1:$F$22,6)","v":"4751004214"},{"$f":"VLOOKUP(Tabla20[[#This Row],[Id Empleado]],Nóminas!$A$2:$G$22,7)","v":"4760004214"},{"$f":"VLOOKUP(Tabla20[[#This Row],[Id Empleado]],Nóminas!$A$2:$E$22,5)","v":"6290004214"},{"$f":"VLOOKUP(Tabla20[[#This Row],[Id Empleado]],Nóminas!$A$2:$J$22,10)","v":"4600004214"},{"$f":"VLOOKUP(Tabla20[[#This Row],[Id Empleado]],Nóminas!$A$2:$M$22,13)","v":""},{"$f":"VLOOKUP(Tabla20[[#This Row],[Id Empleado]],Nóminas!$A$1:$I$22,9)","v":"4650004214"},{"$f":"VLOOKUP(Tabla20[[#This Row],[Id Empleado]],Nóminas!$A$2:$K$22,11)","v":"5720010003"},{"$f":"VLOOKUP(Tabla20[[#This Row],[Id Empleado]],Nóminas!$A$2:$H$22,8)","v":"6420004214"},{"$f":"ROUND(Tabla20[[#This Row],[Salario]]-Tabla20[[#This Row],[Retención IRPF]]-Tabla20[[#This Row],[S.Social Trabajador]]-Tabla20[[#This Row],[Anticipo]]-Tabla20[[#This Row],[Cuota Sind.]],2)","v":773},{"$f":"ROUND(T11+Tabla20[[#This Row],[Dietas]],2)","v":773},{"$f":"ROUND(Tabla20[[#This Row],[Retención IRPF]]+Tabla20[[#This Row],[S.Social Trabajador]]+Tabla20[[#This Row],[S.Social Empresa]]+Tabla20[[#This Row],[Cuota Sind.]],2)","v":592},"Sueldos y salarios 14","H.P acreedora por retenciones practicadas 14","Org. SS, acreedores 14","Anticipo de renumeraciones 14","Cuota sindicato 14","Renumeraciones ptes de pago 14","Dietas 14","42","Bancos Tienda 42","S.S empresa empleado 14","E"]
["31/04/2015",21,{"$f":"VLOOKUP(Tabla20[[#This Row],[Id Empleado]],Nóminas!$A$2:$C$22,3)","v":1050},9,225.75,66.68,315,0,0,"",{"$f":"VLOOKUP(Tabla20[[#This Row],[Id Empleado]],Nóminas!$A$2:$D$22,4)","v":"6400001521"},{"$f":"VLOOKUP(B12,Nóminas!$A$1:$F$22,6)","v":"4751001521"},{"$f":"VLOOKUP(Tabla20[[#This Row],[Id Empleado]],Nóminas!$A$2:$G$22,7)","v":"4760001521"},{"$f":"VLOOKUP(Tabla20[[#This Row],[Id Empleado]],Nóminas!$A$2:$E$22,5)","v":"6290001521"},{"$f":"VLOOKUP(Tabla20[[#This Row],[Id Empleado]],Nóminas!$A$2:$J$22,10)","v":"4600001521"},{"$f":"VLOOKUP(Tabla20[[#This Row],[Id Empleado]],Nóminas!$A$2:$M$22,13)","v":""},{"$f":"VLOOKUP(Tabla20[[#This Row],[Id Empleado]],Nóminas!$A$1:$I$22,9)","v":"4650001521"},{"$f":"VLOOKUP(Tabla20[[#This Row],[Id Empleado]],Nóminas!$A$2:$K$22,11)","v":"5720010002"},{"$f":"VLOOKUP(Tabla20[[#This Row],[Id Empleado]],Nóminas!$A$2:$H$22,8)","v":"6420001521"},{"$f":"ROUND(Tabla20[[#This Row],[Salario]]-Tabla20[[#This Row],[Retención IRPF]]-Tabla20[[#This Row],[S.Social Trabajador]]-Tabla20[[#This Row],[Anticipo]]-Tabla20[[#This Row],[Cuota Sind.]],2)","v":757.57},{"$f":"ROUND(T12+Tabla20[[#This Row],[Dietas]],2)","v":766.57},{"$f":"ROUND(Tabla20[[#This Row],[Retención IRPF]]+Tabla20[[#This Row],[S.Social Trabajador]]+Tabla20[[#This Row],[S.Social Empresa]]+Tabla20[[#This Row],[Cuota Sind.]],2)","v":607.43},"Sueldos y salarios 21","H.P acreedora por retenciones practicadas 21","Org. SS, acreedores 21","Anticipo de renumeraciones 21","Cuota sindicato 21","Renumeraciones ptes de pago 21","Dietas 21","15","Bancos Tienda 15","S.S empresa empleado 21","E"]
["31/04/2015",20,{"$f":"VLOOKUP(Tabla20[[#This Row],[Id Empleado]],Nóminas!$A$2:$C$22,3)","v":1050},0,220.29,66.68,315,0,0,"",{"$f":"VLOOKUP(Tabla20[[#This Row],[Id Empleado]],Nóminas!$A$2:$D$22,4)","v":"6400006120"},{"$f":"VLOOKUP(B13,Nóminas!$A$1:$F$22,6)","v":"4751006120"},{"$f":"VLOOKUP(Tabla20[[#This Row],[Id Empleado]],Nóminas!$A$2:$G$22,7)","v":"4760006120"},{"$f":"VLOOKUP(Tabla20[[#This Row],[Id Empleado]],Nóminas!$A$2:$E$22,5)","v":"6290006120"},{"$f":"VLOOKUP(Tabla20[[#This Row],[Id Empleado]],Nóminas!$A$2:$J$22,10)","v":"4600006120"},{"$f":"VLOOKUP(Tabla20[[#This Row],[Id Empleado]],Nóminas!$A$2:$M$22,13)","v":""},{"$f":"VLOOKUP(Tabla20[[#This Row],[Id Empleado]],Nóminas!$A$1:$I$22,9)","v":"4650006120"},{"$f":"VLOOKUP(Tabla20[[#This Row],[Id Empleado]],Nóminas!$A$2:$K$22,11)","v":"5720010006"},{"$f":"VLOOKUP(Tabla20[[#This Row],[Id Empleado]],Nóminas!$A$2:$H$22,8)","v":"6420006120"},{"$f":"ROUND(Tabla20[[#This Row],[Salario]]-Tabla20[[#This Row],[Retención IRPF]]-Tabla20[[#This Row],[S.Social Trabajador]]-Tabla20[[#This Row],[Anticipo]]-Tabla20[[#This Row],[Cuota Sind.]],2)","v":763.03},{"$f":"ROUND(T13+Tabla20[[#This Row],[Dietas]],2)","v":763.03},{"$f":"ROUND(Tabla20[[#This Row],[Retención IRPF]]+Tabla20[[#This Row],[S.Social Trabajador]]+Tabla20[[#This Row],[S.Social Empresa]]+Tabla20[[#This Row],[Cuota Sind.]],2)","v":601.97},"Sueldos y salarios 20","H.P acreedora por retenciones practicadas 20","Org. SS, acreedores 20","Anticipo de renumeraciones 20","Cuota sindicato 20","Renumeraciones ptes de pago 20","Dietas 20","61","Bancos Tienda 61","S.S empresa empleado 20","E"]

{"sheet":"ConfigNómina","index":27,"n_rows":26,"n_cols":17,"rows_kept":26,"merged":[[0,3,0,5],[1,3,1,5]]}
["Hoja con los datos de entrada:",null,null,"ContabilizaciónNómina"]
["Datos de salida:",null,null,"AstosNómina"]
["Primer número de asiento:",null,null,1]
["Procedimientos a ejecutar previamente:",{"$nulls":3},"Macro11","Macro12"]
[]
[]
[]
[]
["Diario","Fecha","Asiento","Orden","Cuenta","Importe Pts","Concepto","Documento","Debe","Haber","Moneda","Punteo","TipoIVA","Nº IVA","Depto.","Subdepto.","Imagen"]
[1,"A","#1",1,"K",null,"W",null,"C",null,"AG"]
[1,"A","#1",2,"L",null,"X",null,null,"E","AG"]
[1,"A","#1",3,"M",null,"Y",null,null,"F","AG"]
[1,"A","#1",4,"O",null,"Z",null,null,"H","AG"]
[1,"A","#1",5,"P",null,"AA",null,null,"I","AG"]
[1,"A","#1",6,"Q",null,"AB",null,null,"T","AG"]
[1,"A","#2",1,"N",null,"AC",null,"D",null,"AG"]
[1,"A","#2",2,"Q",null,"AB",null,null,"D","AG"]
[1,"A","#3",1,"Q",null,"AB",null,"U",null,"AG"]
[1,"A","#3",2,"R",null,"AE",null,null,"U","AG"]
[1,"A","#4",1,"S",null,"AF",null,"G",null,"AG"]
[1,"A","#4",2,"M",null,"Y",null,null,"G","AG"]
[1,"A","#5",1,"L",null,"X",null,"E",null,"AG"]
[1,"A","#5",2,"M",null,"Y",null,"F",null,"AG"]
[1,"A","#5",3,"P",null,"AA",null,"I",null,"AG"]
[1,"A","#5",4,"M",null,"Y",null,"G",null,"AG"]
[1,"A","#5",5,"R",null,"AE",null,null,"V","AG"]

{"sheet":"AstosNómina","index":28,"n_rows":205,"n_cols":17,"rows_kept":205}
["Diario","Fecha","Asiento","Orden","Cuenta","Importe Pts","Concepto","Documento","Debe","Haber","Moneda","Punteo","TipoIVA","Nº IVA","Depto.","Subdepto.","Imagen"]
[1,"31/04/2015",1,1,6400004405,null,"Sueldos y salarios 5",null,1050,null,"E"]
[1,"31/04/2015",1,2,4751004405,null,"H.P acreedora por retenciones practicadas 5",null,null,245.28,"E"]
[1,"31/04/2015",1,3,4760004405,null,"Org. SS, acreedores 5",null,null,66.68,"E"]
[1,"31/04/2015",1,4,4600004405,null,"Anticipo de renumeraciones 5",null,null,600,"E"]
[1,"31/04/2015",1,5,null,null,"Cuota sindicato 5",null,null,0,"E"]
[1,"31/04/2015",1,6,4650004405,null,"Renumeraciones ptes de pago 5",null,null,138.04,"E"]
[1,"31/04/2015",2,1,6290004405,null,"Dietas 5",null,0,null,"E"]
[1,"31/04/2015",2,2,4650004405,null,"Renumeraciones ptes de pago 5",null,null,0,"E"]
[1,"31/04/2015",3,1,4650004405,null,"Renumeraciones ptes de pago 5",null,138.04,null,"E"]
[1,"31/04/2015",3,2,5720010003,null,"Bancos Tienda 44",null,null,138.04,"E"]
[1,"31/04/2015",4,1,6420004405,null,"S.S empresa empleado 5",null,315,null,"E"]
[1,"31/04/2015",4,2,4760004405,null,"Org. SS, acreedores 5",null,null,315,"E"]
[1,"31/04/2015",5,1,4751004405,null,"H.P acreedora por retenciones practicadas 5",null,245.28,null,"E"]
[1,"31/04/2015",5,2,4760004405,null,"Org. SS, acreedores 5",null,66.68,null,"E"]
[1,"31/04/2015",5,3,null,null,"Cuota sindicato 5",null,0,null,"E"]
[1,"31/04/2015",5,4,4760004405,null,"Org. SS, acreedores 5",null,315,null,"E"]
[1,"31/04/2015",5,5,5720010003,null,"Bancos Tienda 44",null,null,626.96,"E"]
[1,"31/04/2015",6,1,6400005306,null,"Sueldos y salarios 6",null,1050,null,"E"]
[1,"31/04/2015",6,2,4751005306,null,"H.P acreedora por retenciones practicadas 6",null,null,225.96,"E"]
[1,"31/04/2015",6,3,4760005306,null,"Org. SS, acreedores 6",null,null,66.68,"E"]
[1,"31/04/2015",6,4,4600005306,null,"Anticipo de renumeraciones 6",null,null,0,"E"]
[1,"31/04/2015",6,5,4120025306,null,"Cuota sindicato 6",null,null,84,"E"]
[1,"31/04/2015",6,6,4650005306,null,"Renumeraciones ptes de pago 6",null,null,673.36,"E"]
[1,"31/04/2015",7,1,6290005306,null,"Dietas 6",null,18.3,null,"E"]
[1,"31/04/2015",7,2,4650005306,null,"Renumeraciones ptes de pago 6",null,null,18.3,"E"]
[1,"31/04/2015",8,1,4650005306,null,"Renumeraciones ptes de pago 6",null,691.66,null,"E"]
[1,"31/04/2015",8,2,5720010002,null,"Bancos Tienda 53",null,null,691.66,"E"]
[1,"31/04/2015",9,1,6420005306,null,"S.S empresa empleado 6",null,315,null,"E"]
[1,"31/04/2015",9,2,4760005306,null,"Org. SS, acreedores 6",null,null,315,"E"]
[1,"31/04/2015",10,1,4751005306,null,"H.P acreedora por retenciones practicadas 6",null,225.96,null,"E"]
[1,"31/04/2015",10,2,4760005306,null,"Org. SS, acreedores 6",null,66.68,null,"E"]
[1,"31/04/2015",10,3,4120025306,null,"Cuota sindicato 6",null,84,null,"E"]
[1,"31/04/2015",10,4,4760005306,null,"Org. SS, acreedores 6",null,315,null,"E"]
[1,"31/04/2015",10,5,5720010002,null,"Bancos Tienda 53",null,null,691.64,"E"]
[1,"31/04/2015",11,1,6400005407,null,"Sueldos y salarios 7",null,1050,null,"E"]
[1,"31/04/2015",11,2,4751005407,null,"H.P acreedora por retenciones practicadas 7",null,null,232.47,"E"]
[1,"31/04/2015",11,3,4760005407,null,"Org. SS, acreedores 7",null,null,66.68,"E"]
[1,"31/04/2015",11,4,4600005407,null,"Anticipo de renumeraciones 7",null,null,300,"E"]
[1,"31/04/2015",11,5,null,null,"Cuota sindicato 7",null,null,0,"E"]
[1,"31/04/2015",11,6,4650005407,null,"Renumeraciones ptes de pago 7",null,null,450.85,"E"]
[1,"31/04/2015",12,1,6290005407,null,"Dietas 7",null,0,null,"E"]
[1,"31/04/2015",12,2,4650005407,null,"Renumeraciones ptes de pago 7",null,null,0,"E"]
[1,"31/04/2015",13,1,4650005407,null,"Renumeraciones ptes de pago 7",null,450.85,null,"E"]
[1,"31/04/2015",13,2,5720010005,null,"Bancos Tienda 54",null,null,450.85,"E"]
[1,"31/04/2015",14,1,6420005407,null,"S.S empresa empleado 7",null,315,null,"E"]
[1,"31/04/2015",14,2,4760005407,null,"Org. SS, acreedores 7",null,null,315,"E"]
[1,"31/04/2015",15,1,4751005407,null,"H.P acreedora por retenciones practicadas 7",null,232.47,null,"E"]
[1,"31/04/2015",15,2,4760005407,null,"Org. SS, acreedores 7",null,66.68,null,"E"]
[1,"31/04/2015",15,3,null,null,"Cuota sindicato 7",null,0,null,"E"]
[1,"31/04/2015",15,4,4760005407,null,"Org. SS, acreedores 7",null,315,null,"E"]
[1,"31/04/2015",15,5,5720010005,null,"Bancos Tienda 54",null,null,614.15,"E"]
[1,"31/04/2015",16,1,6400006208,null,"Sueldos y salarios 8",null,1050,null,"E"]
[1,"31/04/2015",16,2,4751006208,null,"H.P acreedora por retenciones practicadas 8",null,null,232.79,"E"]
[1,"31/04/2015",16,3,4760006208,null,"Org. SS, acreedores 8",null,null,66.68,"E"]
[1,"31/04/2015",16,4,4600006208,null,"Anticipo de renumeraciones 8",null,null,0,"E"]
[1,"31/04/2015",16,5,null,null,"Cuota sindicato 8",null,null,0,"E"]
[1,"31/04/2015",16,6,4650006208,null,"Renumeraciones ptes de pago 8",null,null,750.53,"E"]
[1,"31/04/2015",17,1,6290006208,null,"Dietas 8",null,0,null,"E"]
[1,"31/04/2015",17,2,4650006208,null,"Renumeraciones ptes de pago 8",null,null,0,"E"]
[1,"31/04/2015",18,1,4650006208,null,"Renumeraciones ptes de pago 8",null,750.53,null,"E"]
[1,"31/04/2015",18,2,5720010006,null,"Bancos Tienda 62",null,null,750.53,"E"]
[1,"31/04/2015",19,1,6420006208,null,"S.S empresa empleado 8",null,315,null,"E"]
[1,"31/04/2015",19,2,4760006208,null,"Org. SS, acreedores 8",null,null,315,"E"]
[1,"31/04/2015",20,1,4751006208,null,"H.P acreedora por retenciones practicadas 8",null,232.79,null,"E"]
[1,"31/04/2015",20,2,4760006208,null,"Org. SS, acreedores 8",null,66.68,null,"E"]
[1,"31/04/2015",20,3,null,null,"Cuota sindicato 8",null,0,null,"E"]
[1,"31/04/2015",20,4,4760006208,null,"Org. SS, acreedores 8",null,315,null,"E"]
[1,"31/04/2015",20,5,5720010006,null,"Bancos Tienda 62",null,null,614.47,"E"]
[1,"31/04/2015",21,1,6400006109,null,"Sueldos y salarios 9",null,1050,null,"E"]
[1,"31/04/2015",21,2,4751006109,null,"H.P acreedora por retenciones practicadas 9",null,null,242.97,"E"]
[1,"31/04/2015",21,3,4760006109,null,"Org. SS, acreedores 9",null,null,66.68,"E"]
[1,"31/04/2015",21,4,4600006109,null,"Anticipo de renumeraciones 9",null,null,0,"E"]
[1,"31/04/2015",21,5,4120016109,null,"Cuota sindicato 9",null,null,52.5,"E"]
[1,"31/04/2015",21,6,4650006109,null,"Renumeraciones ptes de pago 9",null,null,687.85,"E"]
[1,"31/04/2015",22,1,6290006109,null,"Dietas 9",null,0,null,"E"]
[1,"31/04/2015",22,2,4650006109,null,"Renumeraciones ptes de pago 9",null,null,0,"E"]
[1,"31/04/2015",23,1,4650006109,null,"Renumeraciones ptes de pago 9",null,687.85,null,"E"]
[1,"31/04/2015",23,2,5720010006,null,"Bancos Tienda 61",null,null,687.85,"E"]
[1,"31/04/2015",24,1,6420006109,null,"S.S empresa empleado 9",null,315,null,"E"]
[1,"31/04/2015",24,2,4760006109,null,"Org. SS, acreedores 9",null,null,315,"E"]
[1,"31/04/2015",25,1,4751006109,null,"H.P acreedora por retenciones practicadas 9",null,242.97,null,"E"]
[1,"31/04/2015",25,2,4760006109,null,"Org. SS, acreedores 9",null,66.68,null,"E"]
[1,"31/04/2015",25,3,4120016109,null,"Cuota sindicato 9",null,52.5,null,"E"]
[1,"31/04/2015",25,4,4760006109,null,"Org. SS, acreedores 9",null,315,null,"E"]
[1,"31/04/2015",25,5,5720010006,null,"Bancos Tienda 61",null,null,677.15,"E"]
[1,"31/04/2015",26,1,6400006310,null,"Sueldos y salarios 10",null,1050,null,"E"]
[1,"31/04/2015",26,2,4751006310,null,"H.P acreedora por retenciones practicadas 10",null,null,208.43,"E"]
[1,"31/04/2015",26,3,4760006310,null,"Org. SS, acreedores 10",null,null,66.68,"E"]
[1,"31/04/2015",26,4,4600006310,null,"Anticipo de renumeraciones 10",null,null,0,"E"]
[1,"31/04/2015",26,5,4120026310,null,"Cuota sindicato 10",null,null,84,"E"]
[1,"31/04/2015",26,6,4650006310,null,"Renumeraciones ptes de pago 10",null,null,690.89,"E"]
[1,"31/04/2015",27,1,6290006310,null,"Dietas 10",null,21.56,null,"E"]
[1,"31/04/2015",27,2,4650006310,null,"Renumeraciones ptes de pago 10",null,null,21.56,"E"]
[1,"31/04/2015",28,1,4650006310,null,"Renumeraciones ptes de pago 10",null,712.45,null,"E"]
[1,"31/04/2015",28,2,5720010006,null,"Bancos Tienda 63",null,null,712.45,"E"]
[1,"31/04/2015",29,1,6420006310,null,"S.S empresa empleado 10",null,315,null,"E"]
[1,"31/04/2015",29,2,4760006310,null,"Org. SS, acreedores 10",null,null,315,"E"]
[1,"31/04/2015",30,1,4751006310,null,"H.P acreedora por retenciones practicadas 10",null,208.43,null,"E"]
[1,"31/04/2015",30,2,4760006310,null,"Org. SS, acreedores 10",null,66.68,null,"E"]
[1,"31/04/2015",30,3,4120026310,null,"Cuota sindicato 10",null,84,null,"E"]
[1,"31/04/2015",30,4,4760006310,null,"Org. SS, acreedores 10",null,315,null,"E"]
[1,"31/04/2015",30,5,5720010006,null,"Bancos Tienda 63",null,null,674.11,"E"]
[1,"31/04/2015",31,1,6400001111,null,"Sueldos y salarios 11",null,1050,null,"E"]
[1,"31/04/2015",31,2,4751001111,null,"H.P acreedora por retenciones practicadas 11",null,null,243.08,"E"]
[1,"31/04/2015",31,3,4760001111,null,"Org. SS, acreedores 11",null,null,66.68,"E"]
[1,"31/04/2015",31,4,4600001111,null,"Anticipo de renumeraciones 11",null,null,0,"E"]
[1,"31/04/2015",31,5,null,null,"Cuota sindicato 11",null,null,0,"E"]
[1,"31/04/2015",31,6,4650001111,null,"Renumeraciones ptes de pago 11",null,null,740.24,"E"]
[1,"31/04/2015",32,1,6290001111,null,"Dietas 11",null,0,null,"E"]
[1,"31/04/2015",32,2,4650001111,null,"Renumeraciones ptes de pago 11",null,null,0,"E"]
[1,"31/04/2015",33,1,4650001111,null,"Renumeraciones ptes de pago 11",null,740.24,null,"E"]
[1,"31/04/2015",33,2,5720010003,null,"Bancos Tienda 11",null,null,740.24,"E"]
[1,"31/04/2015",34,1,6420001111,null,"S.S empresa empleado 11",null,315,null,"E"]
[1,"31/04/2015",34,2,4760001111,null,"Org. SS, acreedores 11",null,null,315,"E"]
[1,"31/04/2015",35,1,4751001111,null,"H.P acreedora por retenciones practicadas 11",null,243.08,null,"E"]
[1,"31/04/2015",35,2,4760001111,null,"Org. SS, acreedores 11",null,66.68,null,"E"]
[1,"31/04/2015",35,3,null,null,"Cuota sindicato 11",null,0,null,"E"]
[1,"31/04/2015",35,4,4760001111,null,"Org. SS, acreedores 11",null,315,null,"E"]
[1,"31/04/2015",35,5,5720010003,null,"Bancos Tienda 11",null,null,624.76,"E"]
[1,"31/04/2015",36,1,6400003202,null,"Sueldos y salarios 2",null,1050,null,"E"]
[1,"31/04/2015",36,2,4751003202,null,"H.P acreedora por retenciones practicadas 2",null,null,210,"E"]
[1,"31/04/2015",36,3,4760003202,null,"Org. SS, acreedores 2",null,null,66.68,"E"]
[1,"31/04/2015",36,4,4600003202,null,"Anticipo de renumeraciones 2",null,null,0,"E"]
[1,"31/04/2015",36,5,4120023202,null,"Cuota sindicato 2",null,null,84,"E"]
[1,"31/04/2015",36,6,4650003202,null,"Renumeraciones ptes de pago 2",null,null,689.32,"E"]
[1,"31/04/2015",37,1,6290003202,null,"Dietas 2",null,0,null,"E"]
[1,"31/04/2015",37,2,4650003202,null,"Renumeraciones ptes de pago 2",null,null,0,"E"]
[1,"31/04/2015",38,1,4650003202,null,"Renumeraciones ptes de pago 2",null,689.32,null,"E"]
[1,"31/04/2015",38,2,5720010001,null,"Bancos Tienda 32",null,null,689.32,"E"]
[1,"31/04/2015",39,1,6420003202,null,"S.S empresa empleado 2",null,315,null,"E"]
[1,"31/04/2015",39,2,4760003202,null,"Org. SS, acreedores 2",null,null,315,"E"]
[1,"31/04/2015",40,1,4751003202,null,"H.P acreedora por retenciones practicadas 2",null,210,null,"E"]
[1,"31/04/2015",40,2,4760003202,null,"Org. SS, acreedores 2",null,66.68,null,"E"]
[1,"31/04/2015",40,3,4120023202,null,"Cuota sindicato 2",null,84,null,"E"]
[1,"31/04/2015",40,4,4760003202,null,"Org. SS, acreedores 2",null,315,null,"E"]
[1,"31/04/2015",40,5,5720010001,null,"Bancos Tienda 32",null,null,675.68,"E"]
[1,"31/04/2015",41,1,6400001113,null,"Sueldos y salarios 13",null,1050,null,"E"]
[1,"31/04/2015",41,2,4751001113,null,"H.P acreedora por retenciones practicadas 13",null,null,225.44,"E"]
[1,"31/04/2015",41,3,4760001113,null,"Org. SS, acreedores 13",null,null,66.68,"E"]
[1,"31/04/2015",41,4,4600001113,null,"Anticipo de renumeraciones 13",null,null,450,"E"]
[1,"31/04/2015",41,5,null,null,"Cuota sindicato 13",null,null,0,"E"]
[1,"31/04/2015",41,6,4650001113,null,"Renumeraciones ptes de pago 13",null,null,307.88,"E"]
[1,"31/04/2015",42,1,6290001113,null,"Dietas 13",null,0,null,"E"]
[1,"31/04/2015",42,2,4650001113,null,"Renumeraciones ptes de pago 13",null,null,0,"E"]
[1,"31/04/2015",43,1,4650001113,null,"Renumeraciones ptes de pago 13",null,307.88,null,"E"]
[1,"31/04/2015",43,2,5720010003,null,"Bancos Tienda 11",null,null,307.88,"E"]
[1,"31/04/2015",44,1,6420001113,null,"S.S empresa empleado 13",null,315,null,"E"]
[1,"31/04/2015",44,2,4760001113,null,"Org. SS, acreedores 13",null,null,315,"E"]
[1,"31/04/2015",45,1,4751001113,null,"H.P acreedora por retenciones practicadas 13",null,225.44,null,"E"]
[1,"31/04/2015",45,2,4760001113,null,"Org. SS, acreedores 13",null,66.68,null,"E"]
[1,"31/04/2015",45,3,null,null,"Cuota sindicato 13",null,0,null,"E"]
[1,"31/04/2015",45,4,4760001113,null,"Org. SS, acreedores 13",null,315,null,"E"]
[1,"31/04/2015",45,5,5720010003,null,"Bancos Tienda 11",null,null,607.12,"E"]
[1,"31/04/2015",46,1,6400004214,null,"Sueldos y salarios 14",null,1050,null,"E"]
[1,"31/04/2015",46,2,4751004214,null,"H.P acreedora por retenciones practicadas 14",null,null,210.32,"E"]
[1,"31/04/2015",46,3,4760004214,null,"Org. SS, acreedores 14",null,null,66.68,"E"]
[1,"31/04/2015",46,4,4600004214,null,"Anticipo de renumeraciones 14",null,null,0,"E"]
[1,"31/04/2015",46,5,null,null,"Cuota sindicato 14",null,null,0,"E"]
[1,"31/04/2015",46,6,4650004214,null,"Renumeraciones ptes de pago 14",null,null,773,"E"]
[1,"31/04/2015",47,1,6290004214,null,"Dietas 14",null,0,null,"E"]
[1,"31/04/2015",47,2,4650004214,null,"Renumeraciones ptes de pago 14",null,null,0,"E"]
[1,"31/04/2015",48,1,4650004214,null,"Renumeraciones ptes de pago 14",null,773,null,"E"]
[1,"31/04/2015",48,2,5720010003,null,"Bancos Tienda 42",null,null,773,"E"]
[1,"31/04/2015",49,1,6420004214,null,"S.S empresa empleado 14",null,315,null,"E"]
[1,"31/04/2015",49,2,4760004214,null,"Org. SS, acreedores 14",null,null,315,"E"]
[1,"31/04/2015",50,1,4751004214,null,"H.P acreedora por retenciones practicadas 14",null,210.32,null,"E"]
[1,"31/04/2015",50,2,4760004214,null,"Org. SS, acreedores 14",null,66.68,null,"E"]
[1,"31/04/2015",50,3,null,null,"Cuota sindicato 14",null,0,null,"E"]
[1,"31/04/2015",50,4,4760004214,null,"Org. SS, acreedores 14",null,315,null,"E"]
[1,"31/04/2015",50,5,5720010003,null,"Bancos Tienda 42",null,null,592,"E"]
[1,"31/04/2015",51,1,6400001521,null,"Sueldos y salarios 21",null,1050,null,"E"]
[1,"31/04/2015",51,2,4751001521,null,"H.P acreedora por retenciones practicadas 21",null,null,225.75,"E"]
[1,"31/04/2015",51,3,4760001521,null,"Org. SS, acreedores 21",null,null,66.68,"E"]
[1,"31/04/2015",51,4,4600001521,null,"Anticipo de renumeraciones 21",null,null,0,"E"]
[1,"31/04/2015",51,5,null,null,"Cuota sindicato 21",null,null,0,"E"]
[1,"31/04/2015",51,6,4650001521,null,"Renumeraciones ptes de pago 21",null,null,757.57,"E"]
[1,"31/04/2015",52,1,6290001521,null,"Dietas 21",null,9,null,"E"]
[1,"31/04/2015",52,2,4650001521,null,"Renumeraciones ptes de pago 21",null,null,9,"E"]
[1,"31/04/2015",53,1,4650001521,null,"Renumeraciones ptes de pago 21",null,766.57,null,"E"]
[1,"31/04/2015",53,2,5720010002,null,"Bancos Tienda 15",null,null,766.57,"E"]
[1,"31/04/2015",54,1,6420001521,null,"S.S empresa empleado 21",null,315,null,"E"]
[1,"31/04/2015",54,2,4760001521,null,"Org. SS, acreedores 21",null,null,315,"E"]
[1,"31/04/2015",55,1,4751001521,null,"H.P acreedora por retenciones practicadas 21",null,225.75,null,"E"]
[1,"31/04/2015",55,2,4760001521,null,"Org. SS, acreedores 21",null,66.68,null,"E"]
[1,"31/04/2015",55,3,null,null,"Cuota sindicato 21",null,0,null,"E"]
[1,"31/04/2015",55,4,4760001521,null,"Org. SS, acreedores 21",null,315,null,"E"]
[1,"31/04/2015",55,5,5720010002,null,"Bancos Tienda 15",null,null,607.43,"E"]
[1,"31/04/2015",56,1,6400006120,null,"Sueldos y salarios 20",null,1050,null,"E"]
[1,"31/04/2015",56,2,4751006120,null,"H.P acreedora por retenciones practicadas 20",null,null,220.29,"E"]
[1,"31/04/2015",56,3,4760006120,null,"Org. SS, acreedores 20",null,null,66.68,"E"]
[1,"31/04/2015",56,4,4600006120,null,"Anticipo de renumeraciones 20",null,null,0,"E"]
[1,"31/04/2015",56,5,null,null,"Cuota sindicato 20",null,null,0,"E"]
[1,"31/04/2015",56,6,4650006120,null,"Renumeraciones ptes de pago 20",null,null,763.03,"E"]
[1,"31/04/2015",57,1,6290006120,null,"Dietas 20",null,0,null,"E"]
[1,"31/04/2015",57,2,4650006120,null,"Renumeraciones ptes de pago 20",null,null,0,"E"]
[1,"31/04/2015",58,1,4650006120,null,"Renumeraciones ptes de pago 20",null,763.03,null,"E"]
[1,"31/04/2015",58,2,5720010006,null,"Bancos Tienda 61",null,null,763.03,"E"]
[1,"31/04/2015",59,1,6420006120,null,"S.S empresa empleado 20",null,315,null,"E"]
[1,"31/04/2015",59,2,4760006120,null,"Org. SS, acreedores 20",null,null,315,"E"]
[1,"31/04/2015",60,1,4751006120,null,"H.P acreedora por retenciones practicadas 20",null,220.29,null,"E"]
[1,"31/04/2015",60,2,4760006120,null,"Org. SS, acreedores 20",null,66.68,null,"E"]
[1,"31/04/2015",60,3,null,null,"Cuota sindicato 20",null,0,null,"E"]
[1,"31/04/2015",60,4,4760006120,null,"Org. SS, acreedores 20",null,315,null,"E"]
[1,"31/04/2015",60,5,5720010006,null,"Bancos Tienda 61",null,null,601.97,"E"]